{"text_format":"1","workbook":"xlsx","n_sheets":4,"sheets":["Tabela danych","Kalkulacja","Literki","Arkusz3"],"not_rendered":{"charts":0,"images":3,"macros":1,"external_links":0,"defined_names":2,"comments":0,"pivot_tables":0},"unopened":[],"bounds":{"document_bytes":16777216,"sheet_cells":100000,"rows_first":2000,"rows_last":500,"rows_between":2000,"halvings":0,"cell_chars":16384,"cell_head_chars":4096},"cells_cut":0,"cells_raw":0,"read":"whole","date_system":"1900"}

{"sheet":"Tabela danych","index":0,"n_rows":50,"n_cols":40,"rows_kept":50,"cut":false,"hidden":false,"merged":[[49,6,51,7],[31,0,47,0],[22,0,30,0],[2,0,21,0],[39,3,43,3],[39,7,43,7],[31,7,34,7],[35,7,38,7],[44,7,47,7],[44,3,47,3],[31,4,34,4],[35,4,38,4],[39,4,43,4],[31,3,34,3],[35,3,38,3],[44,5,47,5],[44,4,47,4],[26,5,29,5],[31,5,34,5],[35,5,38,5],[39,5,43,5],[26,7,29,7],[3,5,5,5],[6,5,9,5],[10,5,12,5],[13,5,17,5],[18,5,21,5],[3,7,5,7],[6,7,9,7],[10,7,12,7],[13,7,17,7],[18,7,21,7],[26,3,29,3],[3,3,5,3],[6,3,9,3],[10,3,12,3],[3,4,5,4],[6,4,9,4],[10,4,12,4],[48,3,48,10],[3,6,5,6],[6,6,9,6],[10,6,12,6],[13,6,17,6],[18,6,21,6],[26,6,29,6],[31,6,34,6],[35,6,38,6],[39,6,43,6],[44,6,47,6],[13,3,17,3],[18,3,21,3],[13,4,17,4],[18,4,21,4],[26,4,29,4]]}
["W komórce A2 wpisz 5-cio cyfrowy numer katalogowy oprawy bez zasilacza","Ilość opraw na zasilacz [wypełnia się automatycznie po uzupełnieniu komórki A2]","Średnica otworu montażowego [mm]",null,"Odśwież",{"$f":"IF(A2>0,VLOOKUP(A2,Arkusz3!B32:N114,4,0),\" \")","v":" "},"Napięcie [V] oprawy",{"$f":"IF(A2>0,VLOOKUP(A2,Arkusz3!B32:N114,8,0),\" \")","v":" "}]
[null,{"$f":"IF(A2>0,VLOOKUP(A2,Arkusz3!B31:N116,13,0),\" \")","v":" "},{"$f":"IF(A2>0,VLOOKUP(A2,Arkusz3!B32:N114,10,0),\" \")","v":" "},"L.p.","Kod produktu","Nazwa","Wymiary                  L x W x H [mm]","Min otwór montażowy [mm]","Prąd [mA]","Napięcie min [V]","Napięcie max [V]","A","B","C","D","E","F","G","H","I","J","K","L","M","N","O","P","Q","R","S","T","U","V","W","X","Y","Z","AA","AB","AD"]
["ON/OFF",{"$f":"_xlfn._xlws.FILTER($L$3:$AN$48,$L$2:$AN$2=B2)","v":{"$error":"#VALUE!"}},null,1,81224,"POWER SUPPLY On/Off 9W 250mA 2-36V","68 x 41,6 x 22",48,250,2,36,"","","","","","(1-1)","","","","",""," ","","","","","","","","","","","","","","","",""]
[null,null,null,3,81226,"POWER SUPPLY On/Off 22W 125-500mA 5-44V","146,5 x 43,5 x 22",49,250,10,44,"","","","","","(1-1)","","","","(1-1)",""," ","","","","","","","","","","","","","","","","",""]
[null,null,null,null,null,null,null,null,350,10,44,"","","","(2-7)","","","(1-2)","","(1-1)","","(1-1)"," ","(1-1)","","(1-3)","(1-1)","(1-1)","(1-1)","","","","","(1-3)","","","","","","(2-4)"]
[null,null,null,null,null,null,null,null,500,5,44,"","","(1-7)","","(1-5)","","","(1-2)","","","","(1-1)","","(1-1)","","","","","(1-1)","(1-2)","(1-1)","","","","(1-3)","(1-1)","(1-2)","(1-1)",""]
[null,null,null,4,81227,"POWER SUPPLY On/Off 23W 150-700mA 2,5-46V","138,4 x 30 x 21",38,250,2.5,46,"","","","","","(1-1)","","","","(1-1)",""," ","","","","","","","","","","","","","","","","",""]
[null,null,null,null,null,null,null,null,350,2.5,46,"","","","(1-8)","","","(1-2)","","(1-1)","","(1-1)"," ","(1-1)","","(1-3)","(1-1)","(1-1)","(1-1)","","","","","(1-3)","","","","","","(1-5)"]
[null,null,null,null,null,null,null,null,500,2.5,46,"","","(1-7)","","(1-5)","","","(1-2)","","","","(1-1)","","(1-1)","","","","","(1-1)","(1-3)","(1-1)","(1-1)","","","(1-4)","(1-1)","(1-2)","(1-1)",""]
[null,null,null,null,null,null,null,null,700,2.5,32,"(1-9)","(1-10)","","","","","","","","",""," ","","","","","","","","","","","","","","","","",""]
[null,null,null,5,81223,"POWER SUPPLY On/Off 30W 350-725 mA 2-44V","146,5 x 43,5 x 22",49,350,10,44,"","","","(2-7)","","","(1-2)","","(1-1)","","(1-1)"," ","(1-1)","","(1-3)","(1-1)","(1-1)","(1-1)","","","","","(1-3)","","","","","","(2-4)"]
[null,null,null,null,null,null,null,null,500,8,44,"","","(2-7)","","(1-5)","","","(1-2)","","","","(1-1)","","(1-1)","","","","","(1-1)","(1-2)","(1-1)","","","","(1-3)","(1-1)","(1-2)","(1-1)",""]
[null,null,null,null,null,null,null,null,700,5,44,"(2-12)","(2-15)","","","","","","","","",""," ","","","","","","","","","","","","(1-1)","","","","",""]
[null,null,null,6,81228,"POWER SUPPLY On/Off 36W 150-900mA 2,5-50V","163 x 30 x 21",38,250,2.5,50,"","","","","","(1-1)","","","","(1-1)",""," ","","","","","","","","","","","","","","","","",""]
[null,null,null,null,null,null,null,null,350,2.5,50,"","","","(1-8)","","","(1-2)","","(1-1)","","(1-1)"," ","(1-1)","","(1-3)","(1-1)","(1-1)","(1-1)","","","","","(1-3)","","","","","","(1-5)"]
[null,null,null,null,null,null,null,null,500,2.5,50,"","","(1-8)","","(1-5)","","","(1-2)","","","","(1-1)","","(1-1)","","","","","(1-1)","(1-3)","(1-1)","(1-1)","","","(1-4)","(1-1)","(1-2)","(1-1)",""]
[null,null,null,null,null,null,null,null,700,2.5,50,"(1-14)","(1-17)","","","","","","","","",""," ","","","","","","","","","","","","(1-1)","","","","",""]
[null,null,null,null,null,null,null,null,900,2.5,40,"","","","","","","","","","",""," ","","","","","","","","","","","","","","","","",""]
[null,null,null,7,81229,"POWER SUPPLY On/Off 40W 300-1050mA 5-44V","146,5 x 43,5 x 22",50,350,15,44,"","","","(3-8)","","","(1-2)","","(1-1)","","(1-1)"," ","(1-1)","","(2-3)","(1-1)","(1-1)","(1-1)","","","","","(2-3)","","","","","","(2-4)"]
[null,null,null,null,null,null,null,null,500,9,43,"","","(2-7)","","(2-5)","","","(1-2)","","","","(1-1)","","(1-1)","","","","","(1-1)","(1-2)","(1-1)","","","","(1-3)","(1-1)","(1-2)","(1-1)"]
[null,null,null,null,null,null,null,null,700,7,43,"(3-12)","(3-14)","","","","","","","","",""," ","","","","","","","","","","","","(1-1)","","","","",""]
[null,null,null,null,null,null,null,null,1050,5,38,"","","","","","","","","","",""," ","","","","","","","","","","","","","","","","",""]
["Phase-Control",null,null,10,81231,"POWER SUPPLY Phase-Control 10W 250mA 30-42V","85 x 40 x 22",48,250,30,42,"","","","","","(1-1)","","","","",""," ","","","","","","","","","","","","","","","","",""]
[null,null,null,11,81220,"POWER SUPPLY Phase-Control 10W 350mA 12-28V","102 x 38 x 21",45,350,12,28,"","","","(3-5)","","","(1-1)","","(1-1)","",""," ","","","(1-1)","","","","","","","","(1-1)","","","","","","(2-3)"]
[null,null,null,12,81221,"POWER SUPPLY Phase-Control 10W 500mA 9-20V","102 x 38 x 21",45,500,9,20,"","","(2-3)","","(2-2)","","","(1-1)","","",""," ","","","","","","","","(1-1)","","","","","(1-1)","","(1-1)","",""]
[null,null,null,13,81232,"POWER SUPPLY Phase-Control 10W 700mA 6-14V","102 x 38 x 21",45,700,6,14,"(2-4)","(3-4)","","","","","","","","",""," ","","","","","","","","","","","","","","","","",""]
[null,null,null,15,81233,"POWER SUPPLY Phase-Control 20W 250-900mA 7-44V","148 x 38 x 26,5",49,250,7,44,"","","","","","(1-1)","","","","(1-1)",""," ","","","","","","","","","","","","","","","","",""]
[null,null,null,null,null,null,null,null,350,7,44,"","","","(2-7)","","","(1-2)","","(1-1)","","(1-1)"," ","(1-1)","","(1-3)","(1-1)","(1-1)","(1-1)","","","","","(1-3)","","","","","","(1-4)"]
[null,null,null,null,null,null,null,null,500,7,40,"","","(2-6)","","(1-4)","","","(1-2)","","","","(1-1)","","(1-1)","","","","","(1-1)","(1-2)","(1-1)","","","","(1-3)","(1-1)","(1-2)","(1-1)",""]
[null,null,null,null,null,null,null,null,700,7,28,"(3-8)","(3-9)","","","","","","","","",""," ","","","","","","","","","","","","","","","","",""]
[null,null,null,16,81234,"POWER SUPPLY Phase-Control 21W 500mA 25-42V","115 x 41 x 25",50,500,25,42,"","","(5-7)","","(3-4)","","","(2-2)","","","","(1-1)","","(1-1)","","","","","(1-1)","(2-2)","(1-1)","","","","(3-3)","(1-1)","(2-2)","(1-1)",""]
["DALI",null,null,18,81235,"POWER SUPPLY DALI 23W 150-700mA 2,5-46V","138,4 x 30 x 21",38,250,2.5,46,"","","","","","(1-1)","","","","(1-1)",""," ","","","","","","","","","","","","","","","","",""]
[null,null,null,null,null,null,null,null,350,2.5,46,"","","","(1-8)","","","(1-2)","","(1-1)","","(1-1)"," ","(1-1)","","(1-3)","(1-1)","(1-1)","(1-1)","","","","","(1-3)","","","","","","(1-5)"]
[null,null,null,null,null,null,null,null,500,2.5,46,"","","(1-7)","","(1-5)","","","(1-2)","","","","(1-1)","","(1-1)","","","","","(1-1)","(1-3)","(1-1)","(1-1)","","","(1-4)","(1-1)","(1-2)","(1-1)",""]
[null,null,null,null,null,null,null,null,700,2.5,33,"(1-9)","(1-11)","","","","","","","","",""," ","","","","","","","","","","","","","","","","",""]
[null,null,null,19,81222,"POWER SUPPLY DALI 26W 250-700 mA 10-49V","146,5 x 43,5 x 22",50,250,10,49,"","","","","","(1-1)","","","","(1-1)",""," ","","","","","","","","","","","","","","","","",""]
[null,null,null,null,null,null,null,null,350,10,48,"","","","(2-8)","","","(1-2)","","(1-1)","","(1-1)"," ","(1-1)","","(1-3)","(1-1)","(1-1)","(1-1)","","","","","(1-3)","","","","","","(2-5)"]
[null,null,null,null,null,null,null,null,500,10,46,"","","(2-7)","","(2-5)","","","(1-2)","","","","(1-1)","","(1-1)","","","","","(1-1)","(1-3)","(1-1)","(1-1)","","","(1-4)","(1-1)","(1-2)","(1-1)",""]
[null,null,null,null,null,null,null,null,700,10,37,"(3-10)","(4-12)","","","","","","","","",""," ","","","","","","","","","","","","(1-1)","","","","",""]
[null,null,null,20,81236,"POWER SUPPLY DALI 35W 250-1000mA 8-42V","139 x 42 x 30",52,250,20,42,"","","","","","(1-1)","","","","(1-1)",""," ","","","","","","","","","","","","","","","","",""]
[null,null,null,null,null,null,null,null,350,8,42,"","","","(2-7)","","","(1-2)","","(1-1)","","(1-1)"," ","(1-1)","","(1-2)","(1-1)","","(1-1)","","","","","(1-2)","","","","","","(1-4)"]
[null,null,null,null,null,null,null,null,500,8,42,"","","(2-7)","","(1-4)","","","(1-2)","","","","(1-1)","","(1-1)","","","","","(1-1)","(1-2)","(1-1)","","","","(1-3)","(1-1)","(1-2)","(1-1)",""]
[null,null,null,null,null,null,null,null,700,8,42,"(3-12)","(3-14)","","","","","","","","",""," ","","","","","","","","","","","","(1-1)","","","","",""]
[null,null,null,null,null,null,null,null,1000,8,35,"","","","","","","","","","",""," ","","","","","","","","","","","","","","","","",""]
[null,null,null,21,81237,"POWER SUPPLY DALI 36W 150-900mA 2,5-50V","163 x 30 x 21",38,250,2.5,50,"","","","","","(1-1)","","","","(1-1)",""," ","","","","","","","","","","","","","","","","",""]
[null,null,null,null,null,null,null,null,350,2.5,50,"","","","(1-9)","","","(1-2)","","(1-1)","","(1-1)"," ","(1-1)","","(1-3)","(1-1)","(1-1)","(1-1)","","","","","(1-3)","","","","","","(1-5)"]
[null,null,null,null,null,null,null,null,500,2.5,50,"","","(1-8)","","(1-5)","","","(1-2)","","","","(1-1)","","(1-1)","","","","","(1-1)","(1-3)","(1-1)","(1-1)","","","(1-4)","(1-1)","(1-2)","(1-1)",""]
[null,null,null,null,null,null,null,null,700,2.5,50,"(1-14)","(1-17)","","","","","","","","",""," ","","","","","","","","","","","","(1-1)","","","","",""]
[null,null,null,"Przed zamówieniem zawsze należy sprawdzić dostępność zasilaczy. Before ordering, always check the availability of power supplies.\nInne konfiguracje dostępne na zapytanie. Other configurations available on request."]
[null,null,null,null,null,"L - długość / length\nW- szerokość / width\nH - wysokość / height"]

{"sheet":"Kalkulacja","index":1,"n_rows":62,"n_cols":124,"rows_kept":62,"cut":false,"hidden":true,"merged":[]}
[null,null,null,null,null,null,null,null,null,"AQ micro","AQ micro","AQ micro","Points-X1-GR (1szt)","Points-X1-GR (1szt)","Points-X1-GR (1szt)","Points-X1-GR (2szt)","Points x1 gr","Points x1 gr","Points-X1-GR (3szt)","Points x1 gr","Points x1 gr","V6","Points x1 gr (2szt)","Points x1 gr (2szt)","V6-HD","V6","V6","V8         350mA","V8         350mA","V8         350mA","V8         500mA","V8         500mA","V8         500mA","Vero 10SE 350mA","Vero 10SE 350mA","Vero 10SE 350mA","V10     250mA","V10     250mA","V10     250mA","V10     350mA","V10     350mA","V10     350mA","V10     500mA","V10     500mA","V10     500mA","V13    350mA","V13    350mA","V13    350mA","V13    500mA","V13    500mA","V13    500mA","Wallwasher x1","Wallwasher x1","Wallwasher x1","Wallwasher x2","Wallwasher x2","Wallwasher x2","Wallwasher x3","Wallwasher x3","Wallwasher x3","Mini ring rim","Mini ring rim","Mini ring rim","Midi ring rim","Midi ring rim","Midi ring rim","Points-X5-GR (1szt)","Points-X5-GR (1szt)","Points-X5-GR (1szt)","Points-X5-GR (2szt)","Points-X5-GR (2szt)","Points-X5-GR (2szt)","Points-X5-GR (3szt)","Points-X5-GR (3szt)","Points-X5-GR (3szt)","Points-X5-DA","Points-X5-DA","Points-X5-DA","ring","ring","ring","Rafter SQ 8","Rafter SQ 8","Rafter SQ 8","Rafter SQ 11","Rafter SQ 11","Rafter SQ 11","Rafter mini 14","Rafter mini 14","Rafter mini 14","Rafter mini 26","Rafter mini 26","Rafter mini 26","V6","V6","V6"]
[null,"L.p.","Ikona","Nazwa","Nazwa do katalogu","Min otwór montażowy [mm]","Prąd [mA]","Napięcie min [V]","Napięcie max [V]","A","A","A","B","B","B","C","C","C","D","D","D","E","E","E","F","F","F","G","G","G","H","H","H","I","I","I","J","J","J","K","K","K","L","L","L","M","M","M","N","N","N","O","O","O","P","P","P","Q","Q","Q","R","R","R","S","S","S","T","T","T","U","U","U","V","V","V","W","W","W","X","X","X","Y","Y","Y","Z","Z","Z","AA","AA","AA","AB","AB","AB","AD","AD","AD"]
[null,null,null,null,null,null,null,null,null,"min.","max","zakres","min.","max","zakres","min.","max","zakres","min.","max","zakres","min.","max.","zakres","min","max","zakres","min","max","zakres","min","max","zakres","min","max","zakres","min","max","zakres","min","max","zakres","min","max","zakres","min","max","zakres","min","max","zakres","min","max","zakres","min","max","zakres","min","max","zakres","min","max","zakres","min","max","zakres","min","max","zakres","min","max","zakres","min","max","zakres","min","max","zakres","min","max","zakres","min","max","zakres","min","max","zakres","min","max","zakres","min","max","zakres","min","max","zakres"]
[null,1,null,"TCI BULL HPFU 9W 250mA","Zasilacz On/Off 8W AQXXXXX 220-240V/50-60Hz/IP20",48,250,2,36,{"$f":"IF($CY$5>I4,0,IF(G4=$CY$4,IF($CY$5<H4,IF(2*$CY$5<H4,IF(3*$CY$5<H4,IF(4*$CY$5<H4,IF(5*$CY$5<H4,\"\",\"5\"),\"4\"),\"3\"),\"2\"),1),0))","v":0},null,{"$f":"_xlfn.IFNA(IF(J4>0,\"(\"&J4&\"-\"&K4&\")\",\"\"),\"\")","v":""},{"$f":"IF($CY$6>I4,0,IF(G4=$CY$4,IF($CY$6<H4,IF(2*$CY$6<H4,IF(3*$CY$6<H4,IF(4*$CY$6<H4,IF(5*$CY$6<H4,IF(6*$CY$6<H4,\"\",\"6\"),\"5\"),\"4\"),\"3\"),\"2\"),\"1\"),\"0\"))","v":"0"},{"$f":"IF(G4=$CY$4,FLOOR(IF(G4=$CY$4,I4/$CY$6,\"\"),1),\"\")","v":""},{"$f":"IF(M4=\"0\",\"\",\"(\"&M4&\"-\"&N4&\")\")","v":""},{"$f":"IF($CW$7>I4,0,IF(G4=$CW$4,IF($CW$7<H4,IF(2*$CW$7<H4,IF(3*$CW$7<H4,IF(4*$CW$7<H4,\"\",\"4\"),\"3\"),\"2\"),1),0))","v":0},{"$f":"IF(G4=$CW$4,FLOOR(IF(G4=$CW$4,I4/$CW$7,\"\"),1),\"\")","v":""},{"$f":"_xlfn.IFNA(IF(P4>0,\"(\"&P4&\"-\"&Q4&\")\",\"\"),\"\")","v":""},{"$f":"IF($CV$8>I4,0,IF(G4=$CV$4,IF($CV$8<H4,IF(2*$CV$8<H4,IF(3*$CV$8<H4,IF(4*$CV$8<H4,IF(5*$CV$8<H4,IF(6*$CV$8<H4,\"\",\"6\"),\"5\"),\"4\"),\"3\"),\"2\"),1),0))","v":0},{"$f":"IF(G4=$CV$4,FLOOR(IF(G4=$CV$4,I4/$CV$8,\"\"),1),\"\")","v":""},{"$f":"_xlfn.IFNA(IF(S4>0,\"(\"&S4&\"-\"&T4&\")\",\"\"),\"\")","v":""},{"$f":"IF($CW$9>I4,0,IF(G4=$CW$4,IF($CW$9<H4,IF(2*$CW$9<H4,IF(3*$CW$9<H4,IF(4*$CW$9<H4,IF(5*$CW$9<H4,\"\",\"5\"),\"4\"),\"3\"),\"2\"),1),0))","v":0},{"$f":"IF(G4=$CW$4,FLOOR(IF(G4=$CW$4,I4/$CW$9,\"\"),1),\"\")","v":""},{"$f":"_xlfn.IFNA(IF(V4>0,\"(\"&V4&\"-\"&W4&\")\",\"\"),\"\")","v":""},{"$f":"IF($CU$10>I4,0,IF(G4=$CU$4,IF($CU$10<H4,IF(2*$CU$10<H4,IF(3*$CU$10<H4,\"\",\"3\"),\"2\"),1),0))","v":1},{"$f":"IF(G4=$CU$4,FLOOR(IF(G4=$CU$4,I4/$CU$10,\"\"),1),\"\")","v":1},{"$f":"_xlfn.IFNA(IF(Y4>0,\"(\"&Y4&\"-\"&Z4&\")\",\"\"),\"\")","v":"(1-1)"},{"$f":"IF($CV$11>I4,0,IF(G4=$CV$4,IF($CV$11<H4,IF(2*$CV$11<H4,IF(3*$CV$11<H4,\"\",\"3\"),\"2\"),1),0))","v":0},{"$f":"IF(G4=$CV$4,FLOOR(IF(G4=$CV$4,I4/$CV$11,\"\"),1),\"\")","v":""},{"$f":"_xlfn.IFNA(IF(AB4>0,\"(\"&AB4&\"-\"&AC4&\")\",\"\"),\"\")","v":""},{"$f":"IF($CW$12>I4,0,IF(G4=$CW$4,IF($CW$12<H4,IF(2*$CW$12<H4,IF(3*$CW$12<H4,\"\",\"3\"),\"2\"),1),0))","v":0},{"$f":"IF(G4=$CW$4,FLOOR(IF(G4=$CW$4,I4/$CW$12,\"\"),1),\"\")","v":""},{"$f":"_xlfn.IFNA(IF(AE4>0,\"(\"&AE4&\"-\"&AF4&\")\",\"\"),\"\")","v":""},{"$f":"IF($CV$13>I4,0,IF(G4=$CV$4,IF($CV$13<H4,IF(2*$CV$13<H4,IF(3*$CV$13<H4,\"\",\"3\"),\"2\"),1),0))","v":0},{"$f":"IF(G4=$CV$4,FLOOR(IF(G4=$CV$4,I4/$CV$13,\"\"),1),\"\")","v":""},{"$f":"_xlfn.IFNA(IF(AH4>0,\"(\"&AH4&\"-\"&AI4&\")\",\"\"),\"\")","v":""},{"$f":"IF($CU$14>I4,0,IF(G4=$CU$4,IF($CU$14<H4,IF(2*$CU$14<H4,IF(3*$CU$14<H4,\"\",\"3\"),\"2\"),1),0))","v":1},{"$f":"IF(G4=$CU$4,FLOOR(IF(G4=$CU$4,I4/$CU$14,\"\"),1),\"\")","v":1},{"$f":"_xlfn.IFNA(IF(AK4>0,\"(\"&AK4&\"-\"&AL4&\")\",\"\"),\"\")","v":"(1-1)"},{"$f":"IF($CV$4=G4,IF($CV$15>H4,IF($CV$15<I4,\"1\",\"0\"),IF(AND((2*$CV$15>H4),(2*$CJU$15<I4)),\"2\",\"0\")),\"0\")","v":"0"},{"$f":"IF(G4=$CV$4,IF(AND(($CV$15>H4),($CV$15<I4)),IF(2*$CV$15<I4,\"2\",\"1\"),\"0\"),\"0\")","v":"0"},{"$f":"IF(AN4=\"0\",\"\",\"(\"&AN4&\"-\"&AO4&\")\")","v":""},{"$f":"IF($CW$4=G4,IF($CW$16>H4,IF($CW$16<I4,\"1\",\"0\"),IF(AND((2*$CW$16>H4),(2*$CW$16<I4)),\"2\",\"0\")),\"0\")","v":"0"},{"$f":"IF(G4=$CW$4,IF(AND(($CW$16>H4),($CW$16<I4)),IF(2*$CW$16<I4,\"2\",\"1\"),\"0\"),\"0\")","v":"0"},{"$f":"IF(AQ4=\"0\",\" \",\"(\"&AQ4&\"-\"&AR4&\")\")","v":" "},{"$f":"IF($CV$17>I4,0,IF(G4=$CV$4,IF($CV$17<H4,IF(2*$CV$17<H4,IF(3*$CV$17<H4,\"\",\"3\"),\"2\"),1),0))","v":0},{"$f":"IF(G4=$CV$4,FLOOR(IF(G4=$CV$4,I4/$CV$17,\"\"),1),\"\")","v":""},{"$f":"_xlfn.IFNA(IF(AT4>0,\"(\"&AT4&\"-\"&AU4&\")\",\"\"),\"\")","v":""},{"$f":"IF($CW$18>I4,0,IF(G4=$CW$4,IF($CW$18<H4,IF(2*$CW$18<H4,IF(3*$CW$18<H4,\"\",\"3\"),\"2\"),1),0))","v":0},{"$f":"IF(G4=$CW$4,FLOOR(IF(G4=$CW$4,I4/$CW$18,\"\"),1),\"\")","v":""},{"$f":"_xlfn.IFNA(IF(AW4>0,\"(\"&AW4&\"-\"&AX4&\")\",\"\"),\"\")","v":""},{"$f":"IF($CV$19>I4,0,IF(G4=$CV$4,IF($CV$19<H4,IF(2*$CV$19<H4,IF(3*$CV$19<H4,\"\",\"3\"),\"2\"),1),0))","v":0},{"$f":"IF(G4=$CV$4,FLOOR(IF(G4=$CV$4,I4/$CV$19,\"\"),1),\"\")","v":""},{"$f":"_xlfn.IFNA(IF(AZ4>0,\"(\"&AZ4&\"-\"&BA4&\")\",\"\"),\"\")","v":""},{"$f":"IF($CV$20>I4,0,IF(G4=$CV$4,IF($CV$20<H4,IF(2*$CV$20<H4,IF(3*$CV$20<H4,\"\",\"3\"),\"2\"),1),0))","v":0},{"$f":"IF(G4=$CV$4,FLOOR(IF(G4=$CV$4,I4/$CV$20,\"\"),1),\"\")","v":""},{"$f":"_xlfn.IFNA(IF(BC4>0,\"(\"&BC4&\"-\"&BD4&\")\",\"\"),\"\")","v":""},{"$f":"IF($CV$21>I4,0,IF(G4=$CV$4,IF($CV$21<H4,IF(2*$CV$21<H4,IF(3*$CV$21<H4,\"\",\"3\"),\"2\"),1),0))","v":0},{"$f":"IF(G4=$CV$4,FLOOR(IF(G4=$CV$4,I4/$CV$21,\"\"),1),\"\")","v":""},{"$f":"_xlfn.IFNA(IF(BF4>0,\"(\"&BF4&\"-\"&BG4&\")\",\"\"),\"\")","v":""},{"$f":"IF($CV$22>I4,0,IF(G4=$CV$4,IF($CV$22<H4,IF(2*$CV$22<H4,IF(3*$CV$22<H4,\"\",\"3\"),\"2\"),1),0))","v":0},{"$f":"IF(G4=$CV$4,FLOOR(IF(G4=$CV$4,I4/$CV$22,\"\"),1),\"\")","v":""},{"$f":"_xlfn.IFNA(IF(BI4>0,\"(\"&BI4&\"-\"&BJ4&\")\",\"\"),\"\")","v":""},{"$f":"IF($CW$23>I4,0,IF(G4=$CW$4,IF($CW$23<H4,IF(2*$CW$23<H4,IF(3*$CW$23<H4,\"\",\"3\"),\"2\"),1),0))","v":0},{"$f":"IF(G4=$CW$4,FLOOR(IF(G4=$CW$4,I4/$CW$23,\"\"),1),\"\")","v":""},{"$f":"_xlfn.IFNA(IF(BL4>0,\"(\"&BL4&\"-\"&BM4&\")\",\"\"),\"\")","v":""},{"$f":"IF($CW$24>I4,0,IF(G4=$CW$4,IF($CW$24<H4,IF(2*$CW$24<H4,IF(3*$CW$24<H4,\"\",\"3\"),\"2\"),1),0))","v":0},{"$f":"IF(G4=$CW$4,FLOOR(IF(G4=$CW$4,I4/$CW$24,\"\"),1),\"\")","v":""},{"$f":"_xlfn.IFNA(IF(BO4>0,\"(\"&BO4&\"-\"&BP4&\")\",\"\"),\"\")","v":""},{"$f":"IF($CW$25>I4,0,IF(G4=$CW$4,IF($CW$25<H4,IF(2*$CW$25<H4,IF(3*$CW$25<H4,\"\",\"3\"),\"2\"),1),0))","v":0},{"$f":"IF(G4=$CW$4,FLOOR(IF(G4=$CW$4,I4/$CW$25,\"\"),1),\"\")","v":""},{"$f":"_xlfn.IFNA(IF(BR4>0,\"(\"&BR4&\"-\"&BS4&\")\",\"\"),\"\")","v":""},{"$f":"IF($CW$26>I4,0,IF(G4=$CW$4,IF($CW$26<H4,IF(2*$CW$26<H4,IF(3*$CW$26<H4,\"\",\"3\"),\"2\"),1),0))","v":0},{"$f":"IF(G4=$CW$4,FLOOR(IF(G4=$CW$4,I4/$CW$26,\"\"),1),\"\")","v":""},{"$f":"_xlfn.IFNA(IF(BU4>0,\"(\"&BU4&\"-\"&BV4&\")\",\"\"),\"\")","v":""},{"$f":"IF($CV$27>I4,0,IF(G4=$CV$4,IF($CV$27<H4,IF(2*$CV$27<H4,IF(3*$CV$27<H4,\"\",\"3\"),\"2\"),1),0))","v":0},{"$f":"IF(G4=$CV$4,FLOOR(IF(G4=$CV$4,I4/$CV$27,\"\"),1),\"\")","v":""},{"$f":"_xlfn.IFNA(IF(BX4>0,\"(\"&BX4&\"-\"&BY4&\")\",\"\"),\"\")","v":""},{"$f":"IF($CY$28>I4,0,IF(G4=$CY$4,IF($CY$28<H4,IF(2*$CY$28<H4,IF(3*$CY$28<H4,\"\",\"3\"),\"2\"),1),0))","v":0},{"$f":"IF(G4=$CY$4,FLOOR(IF(G4=$CY$4,I4/$CY$28,\"\"),1),\"\")","v":""},{"$f":"_xlfn.IFNA(IF(CA4>0,\"(\"&CA4&\"-\"&CB4&\")\",\"\"),\"\")","v":""},{"$f":"IF($CW$29>I4,0,IF(G4=$CW$4,IF($CW$29<H4,IF(2*$CW$29<H4,IF(3*$CW$29<H4,\"\",\"3\"),\"2\"),1),0))","v":0},{"$f":"IF(G4=$CW$4,FLOOR(IF(G4=$CW$4,I4/$CW$29,\"\"),1),\"\")","v":""},{"$f":"_xlfn.IFNA(IF(CD4>0,\"(\"&CD4&\"-\"&CE4&\")\",\"\"),\"\")","v":""},{"$f":"IF($CW$30>I4,0,IF(G4=$CW$4,IF($CW$30<H4,IF(2*$CW$30<H4,IF(3*$CW$30<H4,\"\",\"3\"),\"2\"),1),0))","v":0},{"$f":"IF(G4=$CW$4,FLOOR(IF(G4=$CW$4,I4/$CW$30,\"\"),1),\"\")","v":""},{"$f":"_xlfn.IFNA(IF(CG4>0,\"(\"&CG4&\"-\"&CH4&\")\",\"\"),\"\")","v":""},{"$f":"IF($CW$31>I4,0,IF(G4=$CW$4,IF($CW$31<H4,IF(2*$CW$31<H4,IF(3*$CW$31<H4,\"\",\"3\"),\"2\"),1),0))","v":0},{"$f":"IF(G4=$CW$4,FLOOR(IF(G4=$CW$4,I4/$CW$31,\"\"),1),\"\")","v":""},{"$f":"_xlfn.IFNA(IF(CJ4>0,\"(\"&CJ4&\"-\"&CK4&\")\",\"\"),\"\")","v":""},{"$f":"IF($CW$32>I4,0,IF(G4=$CW$4,IF($CW$32<H4,IF(2*$CW$32<H4,IF(3*$CW$32<H4,\"\",\"3\"),\"2\"),1),0))","v":0},{"$f":"IF(G4=$CW$4,FLOOR(IF(G4=$CW$4,I4/$CW$32,\"\"),1),\"\")","v":""},{"$f":"_xlfn.IFNA(IF(CM4>0,\"(\"&CM4&\"-\"&CN4&\")\",\"\"),\"\")","v":""},{"$f":"IF($CV$33>I4,0,IF(G4=$CV$4,IF($CV$33<H4,IF(2*$CV$33<H4,IF(3*$CV$33<H4,IF(4*$CV$33<H4,IF(5*$CV$33<H4,\"\",\"5\"),\"4\"),\"3\"),\"2\"),1),0))","v":0},{"$f":"IF(G4=$CV$4,FLOOR(IF(G4=$CV$4,I4/$CV$33,\"\"),1),\"\")","v":""},{"$f":"_xlfn.IFNA(IF(CP4>0,\"(\"&CP4&\"-\"&CQ4&\")\",\"\"),\"\")","v":""},null,null,250,350,500,600,700,1050,null,null,null,null,250,350,500,600,700,1050,null,null,null,null,250,350,500,600,700,1050]
[null,2,null,"TCI BULL 8W 350mA","Zasilacz On/Off 9W AQXXXXX 220-240V/50-60Hz/IP20",42,350,2,22,{"$f":"IF($CY$5>I5,0,IF(G5=$CY$4,IF($CY$5<H5,IF(2*$CY$5<H5,IF(3*$CY$5<H5,IF(4*$CY$5<H5,IF(5*$CY$5<H5,\"\",\"5\"),\"4\"),\"3\"),\"2\"),1),0))","v":0},{"$f":"IF(G5=$CY$4,FLOOR(IF(G5=$CY$4,I5/$CY$5,\"\"),1),\"\")","v":""},{"$f":"_xlfn.IFNA(IF(J5>0,\"(\"&J5&\"-\"&K5&\")\",\"\"),\"\")","v":""},{"$f":"IF($CY$6>I5,0,IF(G5=$CY$4,IF($CY$6<H5,IF(2*$CY$6<H5,IF(3*$CY$6<H5,IF(4*$CY$6<H5,IF(5*$CY$6<H5,IF(6*$CY$6<H5,\"\",\"6\"),\"5\"),\"4\"),\"3\"),\"2\"),\"1\"),\"0\"))","v":"0"},{"$f":"IF(G5=$CY$4,FLOOR(IF(G5=$CY$4,I5/$CY$6,\"\"),1),\"\")","v":""},{"$f":"IF(M5=\"0\",\"\",\"(\"&M5&\"-\"&N5&\")\")","v":""},{"$f":"IF($CW$7>I5,0,IF(G5=$CW$4,IF($CW$7<H5,IF(2*$CW$7<H5,IF(3*$CW$7<H5,IF(4*$CW$7<H5,\"\",\"4\"),\"3\"),\"2\"),1),0))","v":0},{"$f":"IF(G5=$CW$4,FLOOR(IF(G5=$CW$4,I5/$CW$7,\"\"),1),\"\")","v":""},{"$f":"_xlfn.IFNA(IF(P5>0,\"(\"&P5&\"-\"&Q5&\")\",\"\"),\"\")","v":""},{"$f":"IF($CV$8>I5,0,IF(G5=$CV$4,IF($CV$8<H5,IF(2*$CV$8<H5,IF(3*$CV$8<H5,IF(4*$CV$8<H5,IF(5*$CV$8<H5,IF(6*$CV$8<H5,\"\",\"6\"),\"5\"),\"4\"),\"3\"),\"2\"),1),0))","v":1},{"$f":"IF(G5=$CV$4,FLOOR(IF(G5=$CV$4,I5/$CV$8,\"\"),1),\"\")","v":4},{"$f":"_xlfn.IFNA(IF(S5>0,\"(\"&S5&\"-\"&T5&\")\",\"\"),\"\")","v":"(1-4)"},{"$f":"IF($CW$9>I5,0,IF(G5=$CW$4,IF($CW$9<H5,IF(2*$CW$9<H5,IF(3*$CW$9<H5,IF(4*$CW$9<H5,IF(5*$CW$9<H5,\"\",\"5\"),\"4\"),\"3\"),\"2\"),1),0))","v":0},{"$f":"IF(G5=$CW$4,FLOOR(IF(G5=$CW$4,I5/$CW$9,\"\"),1),\"\")","v":""},{"$f":"_xlfn.IFNA(IF(V5>0,\"(\"&V5&\"-\"&W5&\")\",\"\"),\"\")","v":""},{"$f":"IF($CU$10>I5,0,IF(G5=$CU$4,IF($CU$10<H5,IF(2*$CU$10<H5,IF(3*$CU$10<H5,\"\",\"3\"),\"2\"),1),0))","v":0},{"$f":"IF(G5=$CU$4,FLOOR(IF(G5=$CU$4,I5/$CU$10,\"\"),1),\"\")","v":""},{"$f":"_xlfn.IFNA(IF(Y5>0,\"(\"&Y5&\"-\"&Z5&\")\",\"\"),\"\")","v":""},{"$f":"IF($CV$11>I5,0,IF(G5=$CV$4,IF($CV$11<H5,IF(2*$CV$11<H5,IF(3*$CV$11<H5,\"\",\"3\"),\"2\"),1),0))","v":1},{"$f":"IF(G5=$CV$4,FLOOR(IF(G5=$CV$4,I5/$CV$11,\"\"),1),\"\")","v":1},{"$f":"_xlfn.IFNA(IF(AB5>0,\"(\"&AB5&\"-\"&AC5&\")\",\"\"),\"\")","v":"(1-1)"},{"$f":"IF($CW$12>I5,0,IF(G5=$CW$4,IF($CW$12<H5,IF(2*$CW$12<H5,IF(3*$CW$12<H5,\"\",\"3\"),\"2\"),1),0))","v":0},{"$f":"IF(G5=$CW$4,FLOOR(IF(G5=$CW$4,I5/$CW$12,\"\"),1),\"\")","v":""},{"$f":"_xlfn.IFNA(IF(AE5>0,\"(\"&AE5&\"-\"&AF5&\")\",\"\"),\"\")","v":""},{"$f":"IF($CV$13>I5,0,IF(G5=$CV$4,IF($CV$13<H5,IF(2*$CV$13<H5,IF(3*$CV$13<H5,\"\",\"3\"),\"2\"),1),0))","v":0},{"$f":"IF(G5=$CV$4,FLOOR(IF(G5=$CV$4,I5/$CV$13,\"\"),1),\"\")","v":0},{"$f":"_xlfn.IFNA(IF(AH5>0,\"(\"&AH5&\"-\"&AI5&\")\",\"\"),\"\")","v":""},{"$f":"IF($CU$14>I5,0,IF(G5=$CU$4,IF($CU$14<H5,IF(2*$CU$14<H5,IF(3*$CU$14<H5,\"\",\"3\"),\"2\"),1),0))","v":0},{"$f":"IF(G5=$CU$4,FLOOR(IF(G5=$CU$4,I5/$CU$14,\"\"),1),\"\")","v":""},{"$f":"_xlfn.IFNA(IF(AK5>0,\"(\"&AK5&\"-\"&AL5&\")\",\"\"),\"\")","v":""},{"$f":"IF($CV$4=G5,IF($CV$15>H5,IF($CV$15<I5,\"1\",\"0\"),IF(AND((2*$CV$15>H5),(2*$CJU$15<I5)),\"2\",\"0\")),\"0\")","v":"0"},{"$f":"IF(G5=$CV$4,IF(AND(($CV$15>H5),($CV$15<I5)),IF(2*$CV$15<I5,\"2\",\"1\"),\"0\"),\"0\")","v":"0"},{"$f":"IF(AN5=\"0\",\"\",\"(\"&AN5&\"-\"&AO5&\")\")","v":""},{"$f":"IF($CW$4=G5,IF($CW$16>H5,IF($CW$16<I5,\"1\",\"0\"),IF(AND((2*$CW$16>H5),(2*$CW$16<I5)),\"2\",\"0\")),\"0\")","v":"0"},{"$f":"IF(G5=$CW$4,IF(AND(($CW$16>H5),($CW$16<I5)),IF(2*$CW$16<I5,\"2\",\"1\"),\"0\"),\"0\")","v":"0"},{"$f":"IF(AQ5=\"0\",\" \",\"(\"&AQ5&\"-\"&AR5&\")\")","v":" "},{"$f":"IF($CV$17>I5,0,IF(G5=$CV$4,IF($CV$17<H5,IF(2*$CV$17<H5,IF(3*$CV$17<H5,\"\",\"3\"),\"2\"),1),0))","v":0},{"$f":"IF(G5=$CV$4,FLOOR(IF(G5=$CV$4,I5/$CV$17,\"\"),1),\"\")","v":0},{"$f":"_xlfn.IFNA(IF(AT5>0,\"(\"&AT5&\"-\"&AU5&\")\",\"\"),\"\")","v":""},{"$f":"IF($CW$18>I5,0,IF(G5=$CW$4,IF($CW$18<H5,IF(2*$CW$18<H5,IF(3*$CW$18<H5,\"\",\"3\"),\"2\"),1),0))","v":0},{"$f":"IF(G5=$CW$4,FLOOR(IF(G5=$CW$4,I5/$CW$18,\"\"),1),\"\")","v":""},{"$f":"_xlfn.IFNA(IF(AW5>0,\"(\"&AW5&\"-\"&AX5&\")\",\"\"),\"\")","v":""},{"$f":"IF($CV$19>I5,0,IF(G5=$CV$4,IF($CV$19<H5,IF(2*$CV$19<H5,IF(3*$CV$19<H5,\"\",\"3\"),\"2\"),1),0))","v":1},{"$f":"IF(G5=$CV$4,FLOOR(IF(G5=$CV$4,I5/$CV$19,\"\"),1),\"\")","v":1},{"$f":"_xlfn.IFNA(IF(AZ5>0,\"(\"&AZ5&\"-\"&BA5&\")\",\"\"),\"\")","v":"(1-1)"},{"$f":"IF($CV$20>I5,0,IF(G5=$CV$4,IF($CV$20<H5,IF(2*$CV$20<H5,IF(3*$CV$20<H5,\"\",\"3\"),\"2\"),1),0))","v":0},{"$f":"IF(G5=$CV$4,FLOOR(IF(G5=$CV$4,I5/$CV$20,\"\"),1),\"\")","v":0},{"$f":"_xlfn.IFNA(IF(BC5>0,\"(\"&BC5&\"-\"&BD5&\")\",\"\"),\"\")","v":""},{"$f":"IF($CV$21>I5,0,IF(G5=$CV$4,IF($CV$21<H5,IF(2*$CV$21<H5,IF(3*$CV$21<H5,\"\",\"3\"),\"2\"),1),0))","v":0},{"$f":"IF(G5=$CV$4,FLOOR(IF(G5=$CV$4,I5/$CV$21,\"\"),1),\"\")","v":0},{"$f":"_xlfn.IFNA(IF(BF5>0,\"(\"&BF5&\"-\"&BG5&\")\",\"\"),\"\")","v":""},{"$f":"IF($CV$22>I5,0,IF(G5=$CV$4,IF($CV$22<H5,IF(2*$CV$22<H5,IF(3*$CV$22<H5,\"\",\"3\"),\"2\"),1),0))","v":0},{"$f":"IF(G5=$CV$4,FLOOR(IF(G5=$CV$4,I5/$CV$22,\"\"),1),\"\")","v":0},{"$f":"_xlfn.IFNA(IF(BI5>0,\"(\"&BI5&\"-\"&BJ5&\")\",\"\"),\"\")","v":""},{"$f":"IF($CW$23>I5,0,IF(G5=$CW$4,IF($CW$23<H5,IF(2*$CW$23<H5,IF(3*$CW$23<H5,\"\",\"3\"),\"2\"),1),0))","v":0},{"$f":"IF(G5=$CW$4,FLOOR(IF(G5=$CW$4,I5/$CW$23,\"\"),1),\"\")","v":""},{"$f":"_xlfn.IFNA(IF(BL5>0,\"(\"&BL5&\"-\"&BM5&\")\",\"\"),\"\")","v":""},{"$f":"IF($CW$24>I5,0,IF(G5=$CW$4,IF($CW$24<H5,IF(2*$CW$24<H5,IF(3*$CW$24<H5,\"\",\"3\"),\"2\"),1),0))","v":0},{"$f":"IF(G5=$CW$4,FLOOR(IF(G5=$CW$4,I5/$CW$24,\"\"),1),\"\")","v":""},{"$f":"_xlfn.IFNA(IF(BO5>0,\"(\"&BO5&\"-\"&BP5&\")\",\"\"),\"\")","v":""},{"$f":"IF($CW$25>I5,0,IF(G5=$CW$4,IF($CW$25<H5,IF(2*$CW$25<H5,IF(3*$CW$25<H5,\"\",\"3\"),\"2\"),1),0))","v":0},{"$f":"IF(G5=$CW$4,FLOOR(IF(G5=$CW$4,I5/$CW$25,\"\"),1),\"\")","v":""},{"$f":"_xlfn.IFNA(IF(BR5>0,\"(\"&BR5&\"-\"&BS5&\")\",\"\"),\"\")","v":""},{"$f":"IF($CW$26>I5,0,IF(G5=$CW$4,IF($CW$26<H5,IF(2*$CW$26<H5,IF(3*$CW$26<H5,\"\",\"3\"),\"2\"),1),0))","v":0},{"$f":"IF(G5=$CW$4,FLOOR(IF(G5=$CW$4,I5/$CW$26,\"\"),1),\"\")","v":""},{"$f":"_xlfn.IFNA(IF(BU5>0,\"(\"&BU5&\"-\"&BV5&\")\",\"\"),\"\")","v":""},{"$f":"IF($CV$27>I5,0,IF(G5=$CV$4,IF($CV$27<H5,IF(2*$CV$27<H5,IF(3*$CV$27<H5,\"\",\"3\"),\"2\"),1),0))","v":1},1,{"$f":"_xlfn.IFNA(IF(BX5>0,\"(\"&BX5&\"-\"&BY5&\")\",\"\"),\"\")","v":"(1-1)"},{"$f":"IF($CY$28>I5,0,IF(G5=$CY$4,IF($CY$28<H5,IF(2*$CY$28<H5,IF(3*$CY$28<H5,\"\",\"3\"),\"2\"),1),0))","v":0},{"$f":"IF(G5=$CY$4,FLOOR(IF(G5=$CY$4,I5/$CY$28,\"\"),1),\"\")","v":""},{"$f":"_xlfn.IFNA(IF(CA5>0,\"(\"&CA5&\"-\"&CB5&\")\",\"\"),\"\")","v":""},{"$f":"IF($CW$29>I5,0,IF(G5=$CW$4,IF($CW$29<H5,IF(2*$CW$29<H5,IF(3*$CW$29<H5,\"\",\"3\"),\"2\"),1),0))","v":0},{"$f":"IF(G5=$CW$4,FLOOR(IF(G5=$CW$4,I5/$CW$29,\"\"),1),\"\")","v":""},{"$f":"_xlfn.IFNA(IF(CD5>0,\"(\"&CD5&\"-\"&CE5&\")\",\"\"),\"\")","v":""},{"$f":"IF($CW$30>I5,0,IF(G5=$CW$4,IF($CW$30<H5,IF(2*$CW$30<H5,IF(3*$CW$30<H5,\"\",\"3\"),\"2\"),1),0))","v":0},{"$f":"IF(G5=$CW$4,FLOOR(IF(G5=$CW$4,I5/$CW$30,\"\"),1),\"\")","v":""},{"$f":"_xlfn.IFNA(IF(CG5>0,\"(\"&CG5&\"-\"&CH5&\")\",\"\"),\"\")","v":""},{"$f":"IF($CW$31>I5,0,IF(G5=$CW$4,IF($CW$31<H5,IF(2*$CW$31<H5,IF(3*$CW$31<H5,\"\",\"3\"),\"2\"),1),0))","v":0},{"$f":"IF(G5=$CW$4,FLOOR(IF(G5=$CW$4,I5/$CW$31,\"\"),1),\"\")","v":""},{"$f":"_xlfn.IFNA(IF(CJ5>0,\"(\"&CJ5&\"-\"&CK5&\")\",\"\"),\"\")","v":""},{"$f":"IF($CW$32>I5,0,IF(G5=$CW$4,IF($CW$32<H5,IF(2*$CW$32<H5,IF(3*$CW$32<H5,\"\",\"3\"),\"2\"),1),0))","v":0},{"$f":"IF(G5=$CW$4,FLOOR(IF(G5=$CW$4,I5/$CW$32,\"\"),1),\"\")","v":""},{"$f":"_xlfn.IFNA(IF(CM5>0,\"(\"&CM5&\"-\"&CN5&\")\",\"\"),\"\")","v":""},{"$f":"IF($CV$33>I5,0,IF(G5=$CV$4,IF($CV$33<H5,IF(2*$CV$33<H5,IF(3*$CV$33<H5,IF(4*$CV$33<H5,IF(5*$CV$33<H5,\"\",\"5\"),\"4\"),\"3\"),\"2\"),1),0))","v":1},{"$f":"IF(G5=$CV$4,FLOOR(IF(G5=$CV$4,I5/$CV$33,\"\"),1),\"\")","v":2},{"$f":"_xlfn.IFNA(IF(CP5>0,\"(\"&CP5&\"-\"&CQ5&\")\",\"\"),\"\")","v":"(1-2)"},"A","AQ-micro",null,null,null,null,3.4,null,null,null,"A","AQ-micro",null,null,null,null,3.4,null,null,null,"A","AQ-micro",null,null,null,null,3.4]
[null,3,null,"TCI PRO FLAT 22W  ","Zasilacz On/Off 22W AQXXXXX 220-240V/50-60Hz/Ip20",49,250,10,44,0,"","",{"$f":"IF($CY$6>I6,0,IF(G6=$CY$4,IF($CY$6<H6,IF(2*$CY$6<H6,IF(3*$CY$6<H6,IF(4*$CY$6<H6,IF(5*$CY$6<H6,IF(6*$CY$6<H6,\"\",\"6\"),\"5\"),\"4\"),\"3\"),\"2\"),\"1\"),\"0\"))","v":"0"},"","",0,"","",0,"","",0,"","",1,1,"(1-1)",0,"","",0,"","",0,"","",1,1,"(1-1)","0","0","","0","0"," ",0,"","",0,"","",0,"","",0,"","",0,"","",0,"","",0,"","",0,"","",0,"","",0,"","",0,"","",0,"","",0,"","",0,"","",0,"","",0,"","",0,"","","B","Points-X1-GR (1szt)",null,null,null,null,2.9,null,null,null,"B","Points-X1-GR (1szt)",null,2.8,null,null,null,null,null,null,"B","Points-X1-GR (1szt)",null,null,null,null,2.9]
[null,null,null,"TCI PRO FLAT 22W  ","Zasilacz On/Off 22W AQXXXXX 220-240V/50-60Hz/Ip21",49,350,10,44,{"$f":"IF($CY$5>I7,0,IF(G7=$CY$4,IF($CY$5<H7,IF(2*$CY$5<H7,IF(3*$CY$5<H7,IF(4*$CY$5<H7,IF(5*$CY$5<H7,\"\",\"5\"),\"4\"),\"3\"),\"2\"),1),0))","v":0},{"$f":"IF(G7=$CY$4,FLOOR(IF(G7=$CY$4,I7/$CY$5,\"\"),1),\"\")","v":""},{"$f":"_xlfn.IFNA(IF(J7>0,\"(\"&J7&\"-\"&K7&\")\",\"\"),\"\")","v":""},"0","","",{"$f":"IF($CW$7>I7,0,IF(G7=$CW$4,IF($CW$7<H7,IF(2*$CW$7<H7,IF(3*$CW$7<H7,IF(4*$CW$7<H7,\"\",\"4\"),\"3\"),\"2\"),1),0))","v":0},"","",{"$f":"IF($CV$8>I7,0,IF(G7=$CV$4,IF($CV$8<H7,IF(2*$CV$8<H7,IF(3*$CV$8<H7,IF(4*$CV$8<H7,IF(5*$CV$8<H7,IF(6*$CV$8<H7,\"\",\"6\"),\"5\"),\"4\"),\"3\"),\"2\"),1),0))","v":"2"},8,"(2-8)",{"$f":"IF($CW$9>I7,0,IF(G7=$CW$4,IF($CW$9<H7,IF(2*$CW$9<H7,IF(3*$CW$9<H7,IF(4*$CW$9<H7,IF(5*$CW$9<H7,\"\",\"5\"),\"4\"),\"3\"),\"2\"),1),0))","v":0},"","",{"$f":"IF($CU$10>I7,0,IF(G7=$CU$4,IF($CU$10<H7,IF(2*$CU$10<H7,IF(3*$CU$10<H7,\"\",\"3\"),\"2\"),1),0))","v":0},"","",{"$f":"IF($CV$11>I7,0,IF(G7=$CV$4,IF($CV$11<H7,IF(2*$CV$11<H7,IF(3*$CV$11<H7,\"\",\"3\"),\"2\"),1),0))","v":1},2,"(1-2)",{"$f":"IF($CW$12>I7,0,IF(G7=$CW$4,IF($CW$12<H7,IF(2*$CW$12<H7,IF(3*$CW$12<H7,\"\",\"3\"),\"2\"),1),0))","v":0},"","",{"$f":"IF($CV$13>I7,0,IF(G7=$CV$4,IF($CV$13<H7,IF(2*$CV$13<H7,IF(3*$CV$13<H7,\"\",\"3\"),\"2\"),1),0))","v":1},1,"(1-1)",0,"","",{"$f":"IF($CV$4=G7,IF($CV$15>H7,IF($CV$15<I7,\"1\",\"0\"),IF(AND((2*$CV$15>H7),(2*$CJU$15<I7)),\"2\",\"0\")),\"0\")","v":"1"},"1","(1-1)",{"$f":"IF($CW$4=G7,IF($CW$16>H7,IF($CW$16<I7,\"1\",\"0\"),IF(AND((2*$CW$16>H7),(2*$CW$16<I7)),\"2\",\"0\")),\"0\")","v":"0"},"0"," ",{"$f":"IF($CV$17>I7,0,IF(G7=$CV$4,IF($CV$17<H7,IF(2*$CV$17<H7,IF(3*$CV$17<H7,\"\",\"3\"),\"2\"),1),0))","v":1},1,"(1-1)",{"$f":"IF($CW$18>I7,0,IF(G7=$CW$4,IF($CW$18<H7,IF(2*$CW$18<H7,IF(3*$CW$18<H7,\"\",\"3\"),\"2\"),1),0))","v":0},"","",{"$f":"IF($CV$19>I7,0,IF(G7=$CV$4,IF($CV$19<H7,IF(2*$CV$19<H7,IF(3*$CV$19<H7,\"\",\"3\"),\"2\"),1),0))","v":1},3,"(1-3)",{"$f":"IF($CV$20>I7,0,IF(G7=$CV$4,IF($CV$20<H7,IF(2*$CV$20<H7,IF(3*$CV$20<H7,\"\",\"3\"),\"2\"),1),0))","v":1},1,"(1-1)",{"$f":"IF($CV$21>I7,0,IF(G7=$CV$4,IF($CV$21<H7,IF(2*$CV$21<H7,IF(3*$CV$21<H7,\"\",\"3\"),\"2\"),1),0))","v":1},1,"(1-1)",1,1,"(1-1)",0,"","",0,"","",0,"","",0,"","",1,3,"(1-3)",0,"","",0,"","",0,"","",0,"","",0,"","","2",5,"(2-5)","C","Points-X1-GR (2szt)",null,null,5.8,null,null,null,null,null,"C","Points-X1-GR (1szt)",null,null,null,null,2.9,null,null,null,"C","Points-X1-GR (2szt)",null,null,5.8]
[null,null,null,"TCI PRO FLAT 22W  ","Zasilacz On/Off 22W AQXXXXX 220-240V/50-60Hz/Ip22",49,500,5,44,0,"","","0","","",1,7,"(1-7)",0,"","",1,5,"(1-5)",0,"","",0,"","",1,2,"(1-2)",0,"","",0,"","","0","0","","1","1","(1-1)",0,"","",1,1,"(1-1)",0,"","",0,"","",0,"","",0,"","",1,1,"(1-1)",1,2,"(1-2)",1,1,"(1-1)",0,0,"",0,"","",0,"","",1,3,"(1-3)",1,1,"(1-1)",1,2,"(1-2)",1,1,{"$f":"_xlfn.IFNA(IF(CM8>0,\"(\"&CM8&\"-\"&CN8&\")\",\"\"),\"\")","v":"(1-1)"},0,"",{"$f":"_xlfn.IFNA(IF(CP8>0,\"(\"&CP8&\"-\"&CQ8&\")\",\"\"),\"\")","v":""},"D","Points-X1-GR (3szt)",null,5.5,null,null,null,null,null,null,"D","Points-X1-GR (2szt)",5.5,null,null,null,null,null,null,null,"D","V6",null,null,8.6]
[null,4,null,"KGP CC23W100-700 NFC","Zasilacz On/Off 23W AQXXXXX 220-240V/50-60Hz/IP20",38,250,2.5,46,0,"","","0","","",0,"","",0,"","",0,"","",1,1,"(1-1)",0,"","",0,"","",0,"","",1,1,"(1-1)","0","0","","0","0"," ",0,"","",0,"","",0,"","",0,"","",0,"","",{"$f":"IF($CV$22>I9,0,IF(G9=$CV$4,IF($CV$22<H9,IF(2*$CV$22<H9,IF(3*$CV$22<H9,\"\",\"3\"),\"2\"),1),0))","v":0},"","",{"$f":"IF($CW$23>I9,0,IF(G9=$CW$4,IF($CW$23<H9,IF(2*$CW$23<H9,IF(3*$CW$23<H9,\"\",\"3\"),\"2\"),1),0))","v":0},"","",{"$f":"IF($CW$24>I9,0,IF(G9=$CW$4,IF($CW$24<H9,IF(2*$CW$24<H9,IF(3*$CW$24<H9,\"\",\"3\"),\"2\"),1),0))","v":0},"","",{"$f":"IF($CW$25>I9,0,IF(G9=$CW$4,IF($CW$25<H9,IF(2*$CW$25<H9,IF(3*$CW$25<H9,\"\",\"3\"),\"2\"),1),0))","v":0},"","",{"$f":"IF($CW$26>I9,0,IF(G9=$CW$4,IF($CW$26<H9,IF(2*$CW$26<H9,IF(3*$CW$26<H9,\"\",\"3\"),\"2\"),1),0))","v":0},"","",{"$f":"IF($CV$27>I9,0,IF(G9=$CV$4,IF($CV$27<H9,IF(2*$CV$27<H9,IF(3*$CV$27<H9,\"\",\"3\"),\"2\"),1),0))","v":0},"","",{"$f":"IF($CY$28>I9,0,IF(G9=$CY$4,IF($CY$28<H9,IF(2*$CY$28<H9,IF(3*$CY$28<H9,\"\",\"3\"),\"2\"),1),0))","v":0},"","",{"$f":"IF($CW$29>I9,0,IF(G9=$CW$4,IF($CW$29<H9,IF(2*$CW$29<H9,IF(3*$CW$29<H9,\"\",\"3\"),\"2\"),1),0))","v":0},"","",0,"","",0,"","",0,"","",0,"",{"$f":"_xlfn.IFNA(IF(CP9>0,\"(\"&CP9&\"-\"&CQ9&\")\",\"\"),\"\")","v":""},"E","V6",null,null,8.6,null,null,null,null,null,"E","Points-X1-GR (2szt)",null,null,5.8,null,null,null,null,null,"E","V6-HD",35.299999999999997]
[null,null,null,"KGP CC23W100-700 NFC","Zasilacz On/Off 23W AQXXXXX 220-240V/50-60Hz/IP20",38,350,2.5,46,0,"","","0","","",0,"","",1,8,"(1-8)",0,"","",0,"","",1,2,"(1-2)",0,"","",1,1,"(1-1)",0,"","","1","1","(1-1)","0","0"," ",1,1,"(1-1)",0,"","",1,3,"(1-3)",1,1,"(1-1)",1,1,"(1-1)",1,1,"(1-1)",0,"","",0,"","",0,"","",0,"","",1,3,"(1-3)",0,"","",0,"","",{"$f":"IF($CW$30>I10,0,IF(G10=$CW$4,IF($CW$30<H10,IF(2*$CW$30<H10,IF(3*$CW$30<H10,\"\",\"3\"),\"2\"),1),0))","v":0},"","",0,"","",0,"","",1,5,"(1-5)","F","V6-HD",35.299999999999997,null,null,null,null,null,null,null,"F","V6",null,null,8.6,null,null,null,null,null,"F","V8",null,16.7]
[null,null,null,"KGP CC23W100-700 NFC","Zasilacz On/Off 23W AQXXXXX 220-240V/50-60Hz/IP21",38,500,2.5,46,0,"","","0","","",1,7,"(1-7)",0,"","",1,5,"(1-5)",0,"","",0,"","",1,2,"(1-2)",0,"","",0,"","","0","0","","1","1","(1-1)",0,"","",1,1,"(1-1)",0,"","",0,"","",0,"","",0,"","",1,1,"(1-1)",1,3,"(1-3)",1,1,"(1-1)",1,1,"(1-1)",0,"","",0,"","",1,4,"(1-4)",1,1,"(1-1)",1,2,"(1-2)",1,1,"(1-1)",0,"","","G","V8",null,16.7,null,null,null,null,null,null,"G","V6-HD",35.299999999999997,null,null,null,null,null,null,null,"G","V8",null,null,17.2]
[null,null,null,"KGP CC23W100-700 NFC","Zasilacz On/Off 23W AQXXXXX 220-240V/50-60Hz/IP22",38,600,2.5,38,0,"","","0","","",0,"","",0,"","",0,"","",0,"","",{"$f":"IF($CV$11>I12,0,IF(G12=$CV$4,IF($CV$11<H12,IF(2*$CV$11<H12,IF(3*$CV$11<H12,\"\",\"3\"),\"2\"),1),0))","v":0},{"$f":"IF(G12=$CV$4,FLOOR(IF(G12=$CV$4,I12/$CV$11,\"\"),1),\"\")","v":""},{"$f":"_xlfn.IFNA(IF(AB12>0,\"(\"&AB12&\"-\"&AC12&\")\",\"\"),\"\")","v":""},0,"","",0,"","",0,"","","0","0","","0","0"," ",0,"","",0,"","",0,"","",0,"","",0,"","",0,"","",0,"","",0,"","",0,"","",0,"","",0,"","",0,"","",0,"","",0,"","",0,"","",0,"","",0,"","","H","V8",null,null,17.2,null,null,null,null,null,"H","V8",16.3,null,null,null,null,null,null,null,"H","Vero10SE",24.4]
[null,null,null,"KGP CC23W100-700 NFC","Zasilacz On/Off 23W AQXXXXX 220-240V/50-60Hz/IP21",38,700,2.5,32,1,9,"(1-9)","1",11,"(1-11)",0,"","",0,"","",0,"","",0,"","",{"$f":"IF($CV$11>I13,0,IF(G13=$CV$4,IF($CV$11<H13,IF(2*$CV$11<H13,IF(3*$CV$11<H13,\"\",\"3\"),\"2\"),1),0))","v":0},{"$f":"IF(G13=$CV$4,FLOOR(IF(G13=$CV$4,I13/$CV$11,\"\"),1),\"\")","v":""},{"$f":"_xlfn.IFNA(IF(AB13>0,\"(\"&AB13&\"-\"&AC13&\")\",\"\"),\"\")","v":""},0,"","",0,"","",0,"","","0","0","","0","0"," ",0,"","",0,"","",0,"","",0,"","",0,"","",0,"","",0,"","",0,"","",0,"","",0,"","",0,"","",0,0,"",0,"","",0,"","",0,"","",0,"","",0,"","","I","Vero10SE",null,25.1,null,null,null,null,null,null,"I","V8",null,16.7,null,null,null,null,null,null,"I","Vero10SE",null,25.1]
[null,5,null,"Zasilacz TCI PRO FLAT 30W 350-725mA 2-44V z klapkami (127572)","Zasilacz On/Off 30W AQXXXXX 220-240V/50-60Hz/Ip20",49,350,10,44,0,"","","0","","",0,"","","2",8,"(2-8)",0,"","",0,"","",1,{"$f":"IF(G14=$CV$4,FLOOR(IF(G14=$CV$4,I14/$CV$11,\"\"),1),\"\")","v":2},{"$f":"_xlfn.IFNA(IF(AB14>0,\"(\"&AB14&\"-\"&AC14&\")\",\"\"),\"\")","v":"(1-2)"},0,"","",1,1,"(1-1)",0,"","","1","1","(1-1)","0","0"," ",1,1,"(1-1)",0,"","",1,3,"(1-3)",1,1,"(1-1)",1,1,"(1-1)",1,1,"(1-1)",0,"","",0,"","",0,"","",0,"","",1,3,"(1-3)",0,"","",0,"","",0,"","",0,"","",0,"","","2",5,"(2-5)","J","V10",34.200000000000003,null,null,null,null,null,null,null,"J","V8",null,null,17.2,null,null,null,null,null,"J","V10",34.200000000000003]
[null,null,null,"Zasilacz TCI PRO FLAT 30W 350-725mA 2-44V z klapkami (127572)","Zasilacz On/Off 30W AQXXXXX 220-240V/50-60Hz/Ip20",49,500,8,44,0,"","","0","","","2",7,"(2-7)",0,"","",1,5,"(1-5)",0,"","",0,"","",1,2,"(1-2)",0,"","",0,"","","0","0","","1","1","(1-1)",0,"","",1,1,"(1-1)",0,"","",0,"","",0,"","",0,"","",1,1,"(1-1)",1,2,"(1-2)",1,1,"(1-1)",0,0,"",0,"","",0,"","",1,3,"(1-3)",1,1,"(1-1)",1,2,"(1-2)",1,1,"(1-1)",0,"","","K","V10",null,35.299999999999997,null,null,null,null,null,null,"K","Vero10SE",24.4,null,null,null,null,null,null,null,"K","V10",null,35.299999999999997]
[null,null,null,"Zasilacz TCI PRO FLAT 30W 350-725mA 2-44V z klapkami (127572)","Zasilacz On/Off 30W AQXXXXX 220-240V/50-60Hz/Ip21",49,600,5,44,0,"","","0","","",0,"","",0,"","",0,"","",0,"","",0,"","",0,"","",0,"","",0,"","","0","0","","0","0"," ",0,"","",0,"","",0,"","",0,"","",0,"","",0,"","",0,"","",0,"","",0,"","",0,"","",0,"","",0,"","",0,"","",0,"","",0,"","",0,"","",0,"","","L","V10",null,null,36.9,null,null,null,null,null,"L","Vero10SE",null,25.1,null,null,null,null,null,null,"L","V10",null,null,36.9]
[null,null,null,"Zasilacz TCI PRO FLAT 30W 350-725mA 2-44V z klapkami (127572)","Zasilacz On/Off 30W AQXXXXX 220-240V/50-60Hz/Ip21",49,700,5,44,"2",12,"(2-12)","2",15,"(2-15)",0,"","",0,"","",0,"","",0,"","",0,"","",0,"","",0,"","",0,"","","0","0","","0","0"," ",0,"","",0,"","",0,"","",0,"","",0,"","",0,"","",0,"","",0,"","",0,"","",0,"","",0,"","",1,1,"(1-1)",0,"","",0,"","",0,"","",0,"","",0,"","","M","V13",null,32.799999999999997,null,null,null,null,null,null,"M","V10",34.200000000000003,null,null,null,null,null,null,null,"M","V13",null,32.799999999999997]
[null,6,null,"KGP CC36W150-900 NFC","Zasilacz On/Off 36W AQXXXXX 220-240V/50-60Hz/Ip20",38,250,2.5,50,0,"","","0","","",0,"","",0,"","",0,"","",1,1,"(1-1)",0,"","",0,"","",0,"","",1,1,"(1-1)","0","0","","0","0"," ",0,"","",0,"","",0,"","",0,"","",0,"","",0,"","",0,"","",0,"","",0,"","",0,"","",0,"","",0,"","",0,"","",0,"","",0,"","",0,"","",0,"","","N","V13",null,null,33.6,null,null,null,null,null,"N","V10",null,35.299999999999997,null,null,null,null,null,null,"N","V13",null,null,33.6]
[null,null,null,"KGP CC36W150-900 NFC","Zasilacz On/Off 36W AQXXXXX 220-240V/50-60Hz/Ip20",38,350,2.5,50,0,"","","0","","",0,"","",1,9,"(1-9)",0,"","",0,"","",1,2,"(1-2)",0,"","",1,1,"(1-1)",0,"","","1","1","(1-1)","0","0"," ",1,1,"(1-1)",0,"","",1,3,"(1-3)",1,1,"(1-1)",1,1,"(1-1)",1,1,"(1-1)",0,"","",0,"","",0,"","",0,"","",1,3,"(1-3)",0,"","",0,"","",0,"","",0,"","",0,"","",1,5,"(1-5)","O","Wallwasher x1",null,14.1,null,null,null,null,null,null,"O","V10",null,null,36.9,null,null,null,null,null,"O","Wallwasher x1",null,14.1]
[null,null,null,"KGP CC36W150-900 NFC","Zasilacz On/Off 36W AQXXXXX 220-240V/50-60Hz/Ip21",38,500,2.5,50,0,"","","0","","",1,8,"(1-8)",0,"","",1,5,"(1-5)",0,"","",0,"","",1,2,"(1-2)",0,"","",0,"","","0","0","","1","1","(1-1)",0,"","",1,1,"(1-1)",0,"","",0,"","",0,"","",0,"","",1,1,"(1-1)",1,3,"(1-3)",1,1,"(1-1)",1,1,"(1-1)",0,"","",0,"","",1,4,"(1-4)",1,1,"(1-1)",1,2,"(1-2)",1,1,"(1-1)",0,"","","P","Wallwasher x2",null,28.1,null,null,null,null,null,null,"P","V13",32.299999999999997,null,null,null,null,null,null,null,"P","Wallwasher x2",null,28.1]
[null,null,null,"KGP CC36W150-900 NFC","Zasilacz On/Off 36W AQXXXXX 220-240V/50-60Hz/Ip22",38,600,2.5,50,0,null,{"$f":"_xlfn.IFNA(IF(J21>0,\"(\"&J21&\"-\"&K21&\")\",\"\"),\"\")","v":""},"0","","",0,"","",0,"",{"$f":"_xlfn.IFNA(IF(S21>0,\"(\"&S21&\"-\"&T21&\")\",\"\"),\"\")","v":""},0,{"$f":"IF(G21=$CW$4,FLOOR(IF(G21=$CW$4,I21/$CW$9,\"\"),1),\"\")","v":""},{"$f":"_xlfn.IFNA(IF(V21>0,\"(\"&V21&\"-\"&W21&\")\",\"\"),\"\")","v":""},0,{"$f":"IF(G21=$CU$4,FLOOR(IF(G21=$CU$4,I21/$CU$10,\"\"),1),\"\")","v":""},{"$f":"_xlfn.IFNA(IF(Y21>0,\"(\"&Y21&\"-\"&Z21&\")\",\"\"),\"\")","v":""},0,{"$f":"IF(G21=$CV$4,FLOOR(IF(G21=$CV$4,I21/$CV$11,\"\"),1),\"\")","v":""},{"$f":"_xlfn.IFNA(IF(AB21>0,\"(\"&AB21&\"-\"&AC21&\")\",\"\"),\"\")","v":""},0,"","",0,"","",0,"","","0","0","","0","0"," ",0,"","",0,"","",0,"","",0,"","",0,"","",0,"","",0,"","",0,"","",0,"","",0,"","",0,"","",0,"","",0,"","",0,"","",0,"","",0,"","",0,"","","Q","Wallwasher x3",null,42.2,null,null,null,null,null,null,"R","V13",null,32.799999999999997,null,null,null,null,null,null,"R","Wallwasher x3",null,42.2]
[null,null,null,"KGP CC36W150-900 NFC","Zasilacz On/Off 36W AQXXXXX 220-240V/50-60Hz/Ip22",38,700,2.5,50,1,14,{"$f":"_xlfn.IFNA(IF(J22>0,\"(\"&J22&\"-\"&K22&\")\",\"\"),\"\")","v":"(1-14)"},"1",17,"(1-17)",0,"","",0,"",{"$f":"_xlfn.IFNA(IF(S22>0,\"(\"&S22&\"-\"&T22&\")\",\"\"),\"\")","v":""},0,{"$f":"IF(G22=$CW$4,FLOOR(IF(G22=$CW$4,I22/$CW$9,\"\"),1),\"\")","v":""},{"$f":"_xlfn.IFNA(IF(V22>0,\"(\"&V22&\"-\"&W22&\")\",\"\"),\"\")","v":""},0,{"$f":"IF(G22=$CU$4,FLOOR(IF(G22=$CU$4,I22/$CU$10,\"\"),1),\"\")","v":""},{"$f":"_xlfn.IFNA(IF(Y22>0,\"(\"&Y22&\"-\"&Z22&\")\",\"\"),\"\")","v":""},0,{"$f":"IF(G22=$CV$4,FLOOR(IF(G22=$CV$4,I22/$CV$11,\"\"),1),\"\")","v":""},{"$f":"_xlfn.IFNA(IF(AB22>0,\"(\"&AB22&\"-\"&AC22&\")\",\"\"),\"\")","v":""},0,"","",0,"","",0,"","","0","0","","0","0"," ",0,"","",0,"","",0,"","",0,"","",0,"","",0,"","",0,"","",0,"","",0,"","",0,"","",0,"","",1,1,"(1-1)",0,"","",0,"","",0,"","",0,"","",0,"","","R","Mini ring rim",null,35.299999999999997,null,null,null,null,null,null,"S","V13",null,null,33.6,null,null,null,null,null,"S","Mini ring rim",null,35.299999999999997]
[null,null,null,"KGP CC36W150-900 NFC","Zasilacz On/Off 36W AQXXXXX 220-240V/50-60Hz/Ip23",38,900,2.5,40,0,"","","0","","",0,"","",0,"","",0,"","",0,"","",0,"","",0,"","",0,"","",0,"","","0","0","","0","0"," ",0,"","",0,"","",0,"","",0,"","",0,"","",0,"","",0,"","",0,"","",0,"","",0,"","",0,"","",0,"","",0,"","",0,"","",0,"","",0,"","",0,"","","S","MidiRingRim",null,null,34.5,null,null,null,null,null,"T","V13",null,null,null,34.1,null,null,null,null,"T","MidiRingRim",null,null,34.5]
[null,7,null,"TCI PRO FLAT 40W 300-1050mA 5-44V z klapkami (127574)","Zasilacz On/Off 40W AQXXXXX 220-240V/50-60Hz/Ip20",50,350,15,44,0,"","","0","","",0,"","","3",8,"(3-8)",0,"","",0,"","",1,2,"(1-2)",0,"","",1,1,"(1-1)",0,"","","1","1","(1-1)","0","0"," ",1,1,"(1-1)",0,"","","2",3,"(2-3)",1,1,"(1-1)",1,1,"(1-1)",1,1,"(1-1)",0,"","",0,"","",0,"","",0,"","","2",3,"(2-3)",0,"","",0,"","",0,"","",0,"","",0,"","","2",5,"(2-5)","T","Points-X5-GR (1szt)",null,null,14.7,null,null,null,null,null,"U","Wallwasher x1",null,14.1,null,null,null,null,null,null,"U","Points-X1-GR (3szt)",null,8.5]
[null,null,null,"TCI PRO FLAT 40W 300-1050mA 5-44V z klapkami (127574)","Zasilacz On/Off 40W AQXXXXX 220-240V/50-60Hz/Ip20",50,500,9,43,0,"","","0","","","2",7,"(2-7)",0,"","","2",5,"(2-5)",0,"","",0,"","",1,2,"(1-2)",0,"","",0,"","","0","0","","1","1","(1-1)",0,"","",1,1,"(1-1)",0,"","",0,"","",0,"","",0,"","",1,1,"(1-1)",1,2,"(1-2)",1,1,"(1-1)",0,0,"",0,"","",0,"","",1,3,"(1-3)",1,1,"(1-1)",1,2,"(1-2)",1,1,"(1-1)",0,"","","U","Points-X5-GR (2szt)",null,null,29.4,null,null,null,null,null,"W","Wallwasher x2",null,28.1,null,null,null,null,null,null,"W","Points-X5-GR (1szt)",13.9]
[null,null,null,"TCI PRO FLAT 40W 300-1050mA 5-44V z klapkami (127574)","Zasilacz On/Off 40W AQXXXXX 220-240V/50-60Hz/Ip21",50,600,8,43,0,"","","0","","",0,"","",0,"","",0,"","",0,"","",0,"","",0,"","",0,"","",0,"","","0","0","","0","0"," ",0,"","",0,"","",0,"","",0,"","",0,"","",0,"","",0,"","",0,"","",0,"","",0,"","",0,"","",0,"","",0,"","",0,"","",0,"","",0,"","",0,"","","V","Points-X5-GR (3szt)",null,null,44.1,null,null,null,null,null,"V","Wallwasher x3",null,42.2,null,null,null,null,null,null,"V","Points-X5-GR (1szt)",null,null,14.5]
[null,null,null,"TCI PRO FLAT 40W 300-1050mA 5-44V z klapkami (127574)","Zasilacz On/Off 40W AQXXXXX 220-240V/50-60Hz/Ip21",50,700,7,43,"3",12,"(3-12)","3",14,"(3-14)",0,"","",0,"","",0,"","",0,"","",0,"","",0,"","",0,"","",0,"","","0","0","","0","0"," ",0,"","",0,"","",0,"","",0,"","",0,"","",0,"","",0,"","",0,"","",0,"","",0,"","",0,"","",1,1,"(1-1)",0,"","",0,"","",0,"","",0,"","",0,"","","W","Points-X5-DA",null,14.1,null,null,null,null,null,null,"X","Mini ring rim",null,35.299999999999997,null,null,null,null,null,null,"X","Points-X5-GR (2szt)",27.8]
[null,null,null,"TCI PRO FLAT 40W 300-1050mA 5-44V z klapkami (127574)","Zasilacz On/Off 40W AQXXXXX 220-240V/50-60Hz/Ip22",50,1050,5,38,0,"","","0","","",0,"","",0,"","",0,"","",0,"","",0,"","",0,"","",0,"","",{"$f":"IF($CU$14>I28,0,IF(G28=$CU$4,IF($CU$14<H28,IF(2*$CU$14<H28,IF(3*$CU$14<H28,\"\",\"3\"),\"2\"),1),0))","v":0},{"$f":"IF(G28=$CU$4,FLOOR(IF(G28=$CU$4,I28/$CU$14,\"\"),1),\"\")","v":""},"","0","0","","0","0"," ",0,"","",0,"","",0,"","",0,"","",0,"","",0,"","",0,"","",0,"","",0,"","",0,"","",0,"","",0,"","",0,"","",0,"","",0,"","",0,"","",0,"","","X","ring",null,null,null,null,34,null,null,null,"Y","MidiRingRim",null,null,34.5,null,null,null,null,null,"Y","Points-X5-GR (2szt)",null,null,29]
[null,8,null,"TCI Micro MD 7W 250mA 14-28V Phase-Control z klapką (127048)","Zasilacz Phase-Control 7W AQXXXXX 220-20V / 50-60Hz / IP20",44,250,14,28,0,"","","0","","",0,"","",0,"","",0,"","",0,0,"",0,"","",0,"","",0,"","",{"$f":"IF($CU$14>I29,0,IF(G29=$CU$4,IF($CU$14<H29,IF(2*$CU$14<H29,IF(3*$CU$14<H29,\"\",\"3\"),\"2\"),1),0))","v":0},{"$f":"IF(G29=$CU$4,FLOOR(IF(G29=$CU$4,I29/$CU$14,\"\"),1),\"\")","v":0},"","0","0","","0","0"," ",0,"","",0,"","",0,"","",0,"","",0,"","",0,"","",0,"","",0,"","",0,"","",0,"","",0,"","",0,"","",0,"","",0,"","",0,"","",0,"","",0,"","","Y","Rafter SQ 8",null,null,11.5,null,null,null,null,null,"Z","Points-X1-GR (3szt)",null,8.5,null,null,null,null,null,null,"Z","Points-X5-GR (3szt)",41.6]
[null,null,null,"KGP CC7W350-500CG triack","Zasilacz Phase-Control 7W AQXXXXX 220-20V / 50-60Hz / IP21",44,500,7,13,0,"","","0","","","2",2,"(2-2)",0,"","",1,1,"(1-1)",0,"","",0,"","",0,0,"",0,"","",0,"","","0","0","","0","0"," ",0,"","",0,0,"",0,"","",0,"","",0,"","",0,"","",0,0,"",0,0,"",0,0,"",0,0,"",0,"","",0,"","",1,1,"(1-1)",0,0,"",0,0,"",0,0,"",0,"","","Z","Rafter SQ 11",null,null,25.5]
[null,9,null,"HEP G5LT10W250LR-Z 10W 250mA 30-42V Phase-Control z klapkami","Zasilacz Phase-Control 10W AQXXXXX 220-20V / 50-60Hz / IP20",48,250,30,42,0,"","","0","","",0,"","",0,"","",0,"","",1,1,"(1-1)",0,"","",0,"","",0,"","",1,1,{"$f":"_xlfn.IFNA(IF(AK31>0,\"(\"&AK31&\"-\"&AL31&\")\",\"\"),\"\")","v":"(1-1)"},"0","0","","0","0"," ",0,"","",0,"","",0,"","",0,"","",0,"","",0,"","",0,"","",0,"","",0,"","",0,"","",0,"","",0,"","",0,"","",0,"","",0,"","",0,"","",0,"","","AA","Rafter mini 14",null,null,17.399999999999999,null,null,null,null,null,"AA","Points-X5-GR (1szt)",13.9,null,null,null,null,null,null,null,"AB","Points-X5-GR (3szt)",null,null,43.5]
[null,10,null,"TCI Micro MD 10W 350mA 12-28V Phase-Control z klapką (127040)","Zasilacz Phase-Control 10W AQXXXXX 220-20V / 50-60Hz / IP20",45,350,12,28,0,"","","0","","",0,"","","3",5,"(3-5)",0,"","",0,"","",1,1,"(1-1)",0,"","",1,1,"(1-1)",0,"","","0","0","","0","0"," ",0,0,"",0,"","",1,1,"(1-1)",0,0,"",0,0,"",0,0,"",0,"","",0,"","",0,"","",0,"","",1,1,"(1-1)",0,"","",0,"","",0,"","",0,"","",0,"","","2",3,"(2-3)","AB","Rafter mini 26",null,null,35.1,null,null,null,null,null,"AB","Points-X5-GR (1szt)",null,null,14.5,null,null,null,null,null,"AC","Points-X5-DA",null,14.1]
[null,11,null,"TCI Micro MD 10W 500mA 9-20V Phase-Control z klapką (127042)","Zasilacz Phase-Control 10W AQXXXXX 220-20V / 50-60Hz / IP20",45,500,9,20,0,"","","0","","","2",3,"(2-3)",0,"","","2",2,"(2-2)",0,"","",0,"","",1,1,"(1-1)",0,"","",0,"","","0","0","","0","0"," ",0,"","",0,0,"",0,"","",0,"","",0,"","",0,"","",0,0,"",1,1,"(1-1)",0,0,"",0,0,"",0,"","",0,"","",1,1,"(1-1)",0,0,"",1,1,"(1-1)",0,0,"",0,"","","AD","V6",null,8.6,null,null,null,null,null,null,"AC","Points-X5-GR (2szt)",27.8,null,null,null,null,null,null,null,"AD","Vero10SE",null,null,null,null,25.2]
[null,12,null,"TCI Micro MD 10W 700mA 6-14V Phase-Control z klapką (127046)","Zasilacz Phase-Control 10W AQXXXXX 220-20V / 50-60Hz / IP20",45,700,6,14,"2",4,"(2-4)","3",4,"(3-4)",0,"","",0,"","",0,"","",0,"","",0,"","",0,"","",0,"","",0,"","","0","0","","0","0"," ",0,"","",0,"","",0,"","",0,"","",0,"","",0,"","",0,"","",0,"","",0,"","",0,"","",0,"","",0,0,"",0,"","",0,"","",0,"","",0,"","",0,"","",null,null,null,null,null,null,null,null,null,null,"AD","Points-X5-GR (2szt)",null,null,29]
[null,null,null,"KGP CC20W350-500CG triac","Zasilacz Phase-Control 20W AQXXXXX 220-20V / 50-60Hz / IP21",45,350,26,38,0,"","","0","","",0,"","","5",6,"(5-6)",0,"","",0,"","","2",2,"(2-2)",0,"","","2",1,"(2-1)",0,"",{"$f":"_xlfn.IFNA(IF(AK35>0,\"(\"&AK35&\"-\"&AL35&\")\",\"\"),\"\")","v":""},"1","1","(1-1)","0","0"," ",1,1,"(1-1)",0,"","","2",2,"(2-2)",1,1,"(1-1)",0,0,"",1,1,"(1-1)",0,"","",0,"","",0,"","",0,"","","2",2,"(2-2)",0,"","",0,"","",0,"","",0,"","",0,"","","4",4,"(4-4)"]
[null,13,null,"TCI PUMA MD 20W 250-900mA 7-44V Phase-Control z klapkami (127102)","Zasilacz Phase-Control 20W AQXXXXX 220-20V / 50-60Hz / IP20",49,250,7,44,0,"","","0","","",0,"","",0,"","",0,"","",1,1,"(1-1)",0,"","",0,"","",0,"","",1,1,{"$f":"_xlfn.IFNA(IF(AK36>0,\"(\"&AK36&\"-\"&AL36&\")\",\"\"),\"\")","v":"(1-1)"},"0","0","","0","0"," ",0,"","",0,"","",0,"","",0,"","",0,"","",0,"","",0,"","",0,"","",0,"","",0,"","",0,{"$f":"IF(G36=$CV$4,FLOOR(IF(G36=$CV$4,I36/$CV$27,\"\"),1),\"\")","v":""},"",0,"","",0,"","",0,"","",0,"","",0,"","",0,"","",null,null,null,null,null,null,null,null,null,null,"AE","Points-X5-GR (3szt)",41.6]
[null,null,null,"TCI PUMA MD 20W 250-900mA 7-44V Phase-Control z klapkami (127102)","Zasilacz Phase-Control 20W AQXXXXX 220-20V / 50-60Hz / IP20",49,350,7,44,0,"","","0","","",0,"","","2",8,"(2-8)",0,"","",0,"","",1,2,"(1-2)",0,"","",1,1,"(1-1)",0,"","","1","1","(1-1)","0","0"," ",1,1,"(1-1)",0,"","",1,3,"(1-3)",1,1,"(1-1)",1,1,"(1-1)",1,1,"(1-1)",0,"","",0,"","",0,"","",0,"","",1,3,"(1-3)",0,"","",0,"","",0,"","",0,"","",0,"","",1,5,"(1-5)",null,null,null,null,null,null,null," ",null,null,"AF","Points-X5-GR (3szt)",null,null,43.5]
[null,null,null,"TCI PUMA MD 20W 250-900mA 7-44V Phase-Control z klapkami (127102)","Zasilacz Phase-Control 20W AQXXXXX 220-20V / 50-60Hz / IP20",49,500,7,40,0,"","","0","","","2",6,"(2-6)",0,"","",1,4,"(1-4)",0,"","",0,"","",1,2,"(1-2)",0,"","",0,"","","0","0","","1","1","(1-1)",0,"","",1,1,"(1-1)",0,"","",0,"","",0,"","",0,"","",1,1,"(1-1)",1,2,"(1-2)",1,1,"(1-1)",0,0,"",0,"","",0,"","",1,3,"(1-3)",1,1,"(1-1)",1,2,"(1-2)",1,1,"(1-1)",0,"","",null,null,null,null,null,null,null,null,null,null,"AG","Points-X5-DA",null,14.1]
[null,null,null,"TCI PUMA MD 20W 250-900mA 7-44V Phase-Control z klapkami (127102)","Zasilacz Phase-Control 20W AQXXXXX 220-20V / 50-60Hz / IP21",49,600,7,36,0,"","","0","","",0,"","",0,"","",0,"","",0,"","",0,"","",0,"","",0,"","",0,"","","0","0","","0","0"," ",0,"","",0,"","",0,"","",0,"","",0,"","",0,"","",0,"","",0,"","",0,"","",0,"","",0,"","",0,"","",0,"","",0,"","",0,"","",0,"","",0,"","",null,null,null,null,null,null,null,null,null,null,"AH","Vero10SE",null,null,24.4]
[null,null,null,"TCI PUMA MD 20W 250-900mA 7-44V Phase-Control z klapkami (127102)","Zasilacz Phase-Control 20W AQXXXXX 220-20V / 50-60Hz / IP20",49,700,7,28,"3",8,"(3-8)","3",9,"(3-9)",0,"","",0,"","",0,"","",0,"","",0,"","",0,"","",0,"","",0,"","","0","0","","0","0"," ",0,"","",0,"","",0,"","",0,"","",0,"","",0,"","",0,"","",0,"","",0,"","",0,"","",0,"","",0,0,"",0,"","",0,"","",0,"","",0,"","",0,"","",null,null,null,null,null,null,null,null,null,null,"AI","Vero10SE",null,null,null,null,25.2]
[null,14,null,"HEP LETC20W500LR-Z 21W 500mA 25-42V Phase-Control z klapkami","Zasilacz Phase-Control 21W AQXXXXX 220-20V / 50-60Hz / IP20",50,500,25,42,0,"","","0","","","",7,"(-7)",0,"","","3",4,"(3-4)",0,"","",0,"","","2",2,"(2-2)",0,"","",0,"","","0","0","","1","1","(1-1)",0,"","",1,1,"(1-1)",0,"","",0,"","",0,"","",0,"","",1,1,"(1-1)","2",2,"(2-2)",1,1,"(1-1)",0,0,"",0,"","",0,"","","3",3,"(3-3)",1,1,"(1-1)","2",2,"(2-2)",1,1,"(1-1)",0,"",""]
[null,null,null,"KGP CC36W500-700CG triac",null,null,700,30,52,"",15,"(-15)","",17,"(-17)",0,"","",0,"","",0,"","",0,"","",0,"","",0,"","",0,"","",0,"",{"$f":"_xlfn.IFNA(IF(AK42>0,\"(\"&AK42&\"-\"&AL42&\")\",\"\"),\"\")","v":""},"0","0","","0","0"," ",0,"","",0,"","",0,"","",0,"","",0,"","",0,"","",0,"","",0,"","",0,"","",0,"","",0,"","",1,1,"(1-1)",0,"","",0,"","",0,"","",0,"","",0,"",""]
[null,15,null,"KGP CC23W150-900 36W 150-900mA 2,5-50V DALI Switch NFC","Zasilacz DALI 36W AQXXXXXX 220-240V / 50-60Hz / IP20",38,250,2.5,46,0,"","","0","","",0,"","",0,"","",0,"","",1,1,"(1-1)",0,"","",0,"","",0,"","",1,1,{"$f":"_xlfn.IFNA(IF(AK43>0,\"(\"&AK43&\"-\"&AL43&\")\",\"\"),\"\")","v":"(1-1)"},"0","0","","0","0"," ",0,"","",0,"","",0,"","",0,"","",0,"","",0,"","",0,"","",0,"","",0,"","",0,"","",0,"","",0,"","",0,"","",0,"","",0,"","",0,"","",0,"",""]
[null,null,null,"KGP CC23W150-900 36W 150-900mA 2,5-50V DALI Switch NFC","Zasilacz DALI 36W AQXXXXXX 220-240V / 50-60Hz / IP20",38,350,2.5,46,0,"","","0","","",0,"","",1,8,"(1-8)",0,"","",0,"","",1,2,"(1-2)",0,"","",1,1,"(1-1)",0,"",{"$f":"_xlfn.IFNA(IF(AK44>0,\"(\"&AK44&\"-\"&AL44&\")\",\"\"),\"\")","v":""},"1","1","(1-1)","0","0"," ",1,1,"(1-1)",0,"","",1,3,"(1-3)",1,1,"(1-1)",1,1,"(1-1)",1,1,"(1-1)",0,"","",0,"","",0,"","",0,"","",1,3,"(1-3)",0,"","",0,"","",0,"","",0,"","",0,"","",1,5,"(1-5)"]
[null,null,null,"KGP CC23W150-900 36W 150-900mA 2,5-50V DALI Switch NFC","Zasilacz DALI 36W AQXXXXXX 220-240V / 50-60Hz / IP20",38,500,2.5,46,0,"","","0","","",1,7,"(1-7)",0,"","",1,5,"(1-5)",0,"","",0,"","",1,2,"(1-2)",0,"","",0,"","","0","0","","1","1","(1-1)",0,"","",1,1,"(1-1)",0,"","",0,"","",0,"","",0,"","",1,1,"(1-1)",1,3,"(1-3)",1,1,"(1-1)",1,1,"(1-1)",0,"","",0,"","",1,4,"(1-4)",1,1,"(1-1)",1,2,"(1-2)",1,1,"(1-1)",0,"",""]
[null,null,null,"KGP CC23W150-900 36W 150-900mA 2,5-50V DALI Switch NFC","Zasilacz DALI 36W AQXXXXXX 220-240V / 50-60Hz / IP20",38,700,2.5,33,1,9,"(1-9)","1",11,"(1-11)",0,"","",0,"","",0,"","",0,"","",0,"","",0,"","",0,"","",0,"","","0","0","","0","0"," ",0,"","",0,"","",0,"","",0,"","",0,"","",0,"","",0,"","",0,"","",0,"","",0,"","",0,"","",0,0,"",0,"","",0,"","",0,"","",0,"","",0,"",""]
[null,16,null,"TCI PRO FLAT 26W 250-700mA 10-49V DALI Switch z klapkami (127576)","Zasilacz DALI 26W AQXXXXXX 220-240V / 50-60Hz / IP20",50,250,10,49,0,"","","0","","",0,"","",0,"","",0,"","",1,1,"(1-1)",0,"","",0,"","",0,"","",1,1,"(1-1)","0","0","","0","0"," ",0,"","",0,"","",0,"","",0,"","",0,"","",0,"","",0,"","",0,"","",0,"","",0,"","",0,"","",0,"","",0,"","",0,"","",0,"","",0,"","",0,"",""]
[null,null,null,"TCI PRO FLAT 26W 250-700mA 10-49V DALI Switch z klapkami (127576)","Zasilacz DALI 26W AQXXXXXX 220-240V / 50-60Hz / IP20",50,350,10,48,0,"","","0","","",0,"","","2",8,"(2-8)",0,"","",0,"","",1,2,"(1-2)",0,"","",1,1,"(1-1)",0,"","","1","1","(1-1)","0","0"," ",1,1,"(1-1)",0,"","",1,3,"(1-3)",1,1,"(1-1)",1,1,"(1-1)",1,1,"(1-1)",0,"","",0,"","",0,"","",0,"","",1,3,"(1-3)",0,"","",0,"","",0,"","",0,"","",0,"","","2",5,"(2-5)"]
[null,null,null,"TCI PRO FLAT 26W 250-700mA 10-49V DALI Switch z klapkami (127576)","Zasilacz DALI 26W AQXXXXXX 220-240V / 50-60Hz / IP20",50,500,10,46,0,"","","0","","","2",7,"(2-7)",0,"","","2",5,"(2-5)",0,"","",0,"","",1,2,"(1-2)",0,"","",0,"","","0","0","","1","1","(1-1)",0,"","",1,1,"(1-1)",0,"","",0,"","",0,"","",0,"","",1,1,"(1-1)",1,3,"(1-3)",1,1,"(1-1)",1,1,"(1-1)",0,"","",0,"","",1,4,"(1-4)",1,1,"(1-1)",1,2,"(1-2)",1,1,"(1-1)",0,"",""]
[null,null,null,"TCI PRO FLAT 26W 250-700mA 10-49V DALI Switch z klapkami (127576)","Zasilacz DALI 26W AQXXXXXX 220-240V / 50-60Hz / IP21",50,600,10,44,0,"","","0","","",0,"","",0,"","",0,"","",0,"","",0,"","",0,"","",0,"","",0,"","","0","0","","0","0"," ",0,"","",0,"","",0,"","",0,"","",0,"","",0,"","",0,"","",0,"","",0,"","",0,"","",0,"","",0,"","",0,"","",0,"","",0,"","",0,"","",0,"",""]
[null,null,null,"TCI PRO FLAT 26W 250-700mA 10-49V DALI Switch z klapkami (127576)","Zasilacz DALI 26W AQXXXXXX 220-240V / 50-60Hz / IP20",50,700,10,37,"3",10,"(3-10)","4",12,"(4-12)",0,"","",0,"","",0,"","",0,"","",0,"","",0,"","",0,"","",0,"","","0","0","","0","0"," ",0,"","",0,"","",0,"","",0,"","",0,"","",0,"","",0,"","",0,"","",0,"","",0,"","",0,"","",1,1,"(1-1)",0,"","",0,"","",0,"","",0,"","",0,"",""]
[null,17,null,"Zasilacz Self SLD35-1000IBD-UN 35W 250-1000mA 8-42V DALI","Zasilacz DALI 26W AQXXXXXX 220-240V / 50-60Hz / IP20",52,250,20,42,0,"","","0","","",0,"","",0,"","",0,"","",1,1,"(1-1)",0,"","",0,"","",0,"","",1,1,"(1-1)","0","0","","0","0"," ",0,"","",0,"","",0,"","",0,"","",0,"","",0,"","",0,"","",0,"","",0,"","",0,"","",0,"","",0,"","",0,"","",0,"","",0,"","",0,"","",0,"",""]
[null,null,null,"Zasilacz Self SLD35-1000IBD-UN 35W 250-1000mA 8-42V DALI","Zasilacz DALI 26W AQXXXXXX 220-240V / 50-60Hz / IP20",52,350,8,42,0,"","","0","","",0,"","","2",7,"(2-7)",0,"","",0,"","",1,2,"(1-2)",0,"","",1,1,"(1-1)",0,"","","1","1","(1-1)","0","0"," ",1,1,"(1-1)",0,"","",1,2,"(1-2)",1,1,"(1-1)",0,0,"",1,1,"(1-1)",0,"","",0,"","",0,"","",0,"","",1,2,"(1-2)",0,"","",0,"","",0,"","",0,"","",0,"","",1,4,"(1-4)"]
[null,null,null,"Zasilacz Self SLD35-1000IBD-UN 35W 250-1000mA 8-42V DALI","Zasilacz DALI 26W AQXXXXXX 220-240V / 50-60Hz / IP20",52,500,8,42,0,"","","0","","","2",7,"(2-7)",0,"","",1,4,"(1-4)",0,"","",0,"","",1,2,"(1-2)",0,"","",0,"","","0","0","","1","1","(1-1)",0,"","",1,1,"(1-1)",0,"","",0,"","",0,"","",0,"","",1,1,"(1-1)",1,2,"(1-2)",1,1,"(1-1)",0,0,"",0,"","",0,"","",1,3,"(1-3)",1,1,"(1-1)",1,2,"(1-2)",1,1,"(1-1)",0,"",""]
[null,null,null,"Zasilacz Self SLD35-1000IBD-UN 35W 250-1000mA 8-42V DALI","Zasilacz DALI 26W AQXXXXXX 220-240V / 50-60Hz / IP21",52,600,8,42,0,"","","0","","",0,"","",0,"","",0,"","",0,"","",0,"","",0,"","",0,"","",0,"","","0","0","","0","0"," ",0,"","",0,"","",0,"","",0,"","",0,"","",0,"","",0,"","",0,"","",0,"","",0,"","",0,"","",0,"","",0,"","",0,"","",0,"","",0,"","",0,"",""]
[null,null,null,"Zasilacz Self SLD35-1000IBD-UN 35W 250-1000mA 8-42V DALI","Zasilacz DALI 26W AQXXXXXX 220-240V / 50-60Hz / IP20",52,700,8,42,"3",12,"(3-12)","3",14,"(3-14)",0,"","",0,"","",0,"","",0,"","",0,"","",0,"","",0,"","",0,"","","0","0","","0","0"," ",0,"","",0,"","",0,"","",0,"","",0,"","",0,"","",0,"","",0,"","",0,"","",0,"","",0,"","",1,1,"(1-1)",0,"","",0,"","",0,"","",0,"","",0,"",""]
[null,null,null,"Zasilacz Self SLD35-1000IBD-UN 35W 250-1000mA 8-42V DALI","Zasilacz DALI 26W AQXXXXXX 220-240V / 50-60Hz / IP20",52,1000,8,35,0,"","","0","","",0,"","",0,"","",0,"","",0,"","",0,"","",0,"","",0,"","",0,"","","0","0","","0","0"," ",0,"","",0,"","",0,"","",0,"","",0,"","",0,"","",0,"","",0,"","",0,"","",0,"","",0,"","",0,"","",0,"","",0,"","",0,"","",0,"","",0,"",""]
[null,18,null,"KGP CC36W150-900 36W 150-900mA 2,5-50V DALI Switch NFC","Zasilacz DALI 36W AQXXXXXX 220-240V / 50-60Hz / IP20",38,250,2.5,50,0,"","","0","","",0,"","",0,"","",0,"","",1,1,"(1-1)",0,"","",0,"","",0,"","",1,1,"(1-1)","0","0","","0","0"," ",0,"","",0,"","",0,"","",0,"","",0,"","",0,"","",0,"","",0,"","",0,"","",0,"","",0,"","",0,"","",0,"","",0,"","",0,"","",0,"","",0,"",""]
[null,null,null,"KGP CC36W150-900 36W 150-900mA 2,5-50V DALI Switch NFC","Zasilacz DALI 36W AQXXXXXX 220-240V / 50-60Hz / IP20",38,350,2.5,50,0,"","","0","","",0,"","",1,9,"(1-9)",0,"","",0,"","",1,2,"(1-2)",0,"","",1,1,"(1-1)",0,"","","1","1","(1-1)","0","0"," ",1,1,"(1-1)",0,"","",1,3,"(1-3)",1,1,"(1-1)",1,1,"(1-1)",1,1,"(1-1)",0,"","",0,"","",0,"","",0,"","",1,3,"(1-3)",0,"","",0,"","",0,"","",0,"","",0,"","",1,5,"(1-5)"]
[null,null,null,"KGP CC36W150-900 36W 150-900mA 2,5-50V DALI Switch NFC","Zasilacz DALI 36W AQXXXXXX 220-240V / 50-60Hz / IP21",38,500,2.5,50,0,"","","0","","",1,8,"(1-8)",0,"","",1,5,"(1-5)",0,"","",0,"","",1,2,"(1-2)",0,"","",0,"","","0","0","","1","1","(1-1)",0,"","",1,1,"(1-1)",0,"","",0,"","",0,"","",0,"","",1,1,"(1-1)",1,3,"(1-3)",1,1,"(1-1)",1,1,"(1-1)",0,"","",0,"","",1,4,"(1-4)",1,1,"(1-1)",1,2,"(1-2)",1,1,"(1-1)",0,"",""]
[null,null,null,"KGP CC36W150-900 36W 150-900mA 2,5-50V DALI Switch NFC","Zasilacz DALI 36W AQXXXXXX 220-240V / 50-60Hz / IP22",38,600,2.5,50,0,"","","0","","",0,"","",0,"","",0,"","",0,"","",0,"","",0,"","",0,"","",0,"","","0","0","","0","0"," ",0,"","",0,"","",0,"","",0,"","",0,"","",0,"","",0,"","",0,"","",0,"","",0,"","",0,"","",0,"","",0,"","",0,"","",0,"","",0,"","",0,"",""]
[null,null,null,"KGP CC36W150-900 36W 150-900mA 2,5-50V DALI Switch NFC","Zasilacz DALI 36W AQXXXXXX 220-240V / 50-60Hz / IP20",38,700,2.5,50,1,14,"(1-14)","1",17,"(1-17)",0,"","",0,"","",0,"","",0,"","",0,"","",0,"","",0,"","",0,"","","0","0","","0","0"," ",0,"","",0,"","",0,"","",0,"","",0,"","",0,"","",0,"","",0,"","",0,"","",0,"","",0,"","",1,1,"(1-1)",0,"","",0,"","",0,"","",0,"","",0,"",""]

{"sheet":"Literki","index":2,"n_rows":30,"n_cols":8,"rows_kept":30,"cut":false,"hidden":true,"merged":[]}
[null,null,250,350,500,600,700,1050]
["A","AQ-micro",null,null,null,null,3.4]
["B","Points-X1-GR (1szt)",null,null,null,null,2.9]
["C","Points-X1-GR (2szt)",null,null,5.8]
["D","Points-X1-GR (3szt)",null,5.5]
["E","V6",null,null,8.6]
["F","V6-HD",35.299999999999997]
["G","V8",null,16.7]
["H","V8",null,null,17.2]
["I","Vero10SE",null,25.1]
["J","V10",34.200000000000003]
["K","V10",null,35.299999999999997]
["L","V10",null,null,36.9]
["M","V13",null,32.799999999999997]
["N","V13",null,null,33.6]
["O","Wallwasher x1",null,14.1]
["P","Wallwasher x2",null,28.1]
["Q","Wallwasher x3",null,42.2]
["R","Mini ring rim",null,35.299999999999997]
["S","MidiRingRim",null,null,34.5]
["T","Points-X5-GR (1szt)",null,null,14.7]
["U","Points-X5-GR (2szt)",null,null,29.4]
["V","Points-X5-GR (3szt)",null,null,44.1]
["W","Points-X5-DA",null,14.1]
["X","ring",null,null,null,null,34]
["Y","Rafter SQ 8",null,null,11.5]
["Z","Rafter SQ 11",null,null,25.5]
["AA","Rafter mini 14",null,null,17.399999999999999]
["AB","Rafter mini 26",null,null,35.1]
["AD","V6",null,8.6]

{"sheet":"Arkusz3","index":3,"n_rows":164,"n_cols":27,"rows_kept":164,"cut":false,"hidden":true,"merged":[]}
[null,null,null,null,null,"Prąd","Napięcie min [V]","Napięcie max [V]","Kod komponentu","Nazwa zasilacza","Przekątna boku zasilacza",null,null,null,null,null,null,null,null,null,null,250,350,500,600,700,1050]
[null,null,null,null,null,null,null,null,null,null,null,null,null,null,null,null,null,null,null,"A","AQ-micro",null,null,null,null,3.4]
[null,null,null,null,null,250,2,36,"E01781","TCI BULL",47.1,null,null,null,null,null,null,null,null,"B","Points-X1-GR (1szt)",null,null,null,null,2.9]
[null,null,null,null,null,null,36,50,"X","X","X",null,null,null,null,null,null,null,null,"C","Points-X1-GR (2szt)",null,null,5.8]
[null,null,null,null,null,null,null,null,null,null,null,null,null,null,null,null,null,null,null,"D","Points-X1-GR (3szt)",null,5.5]
[null,null,null,null,null,null,null,null,null,null,null,null,null,null,null,null,null,null,null,"E","V6",null,null,8.6]
[null,null,null,null,null,350,2,10,"E00763","TCI BULL 8W",43.5,null,null,null,null,null,null,null,null,"F","V6-HD",35.299999999999997,null,8.6]
[null,null,null,null,null,null,11,44,"E00878","TCI PRO FLAT 30",43.5,null,null,null,null,null,null,null,null,"G","V8",null,16.7]
[null,null,null,null,null,null,45,50,"X","X","X",null,null,null,null,null,null,null,null,"H","V8",null,null,17.2]
[null,null,null,null,null,null,null,null,null,null,null,null,null,null,null,null,null,null,null,"I","Vero10SE",null,25.1]
[null,null,null,null,null,500,5,10,"E01249","TCI PRO FLAT 22",43.5,null,null,null,null,null,null,null,null,"J","V10",34.200000000000003]
[null,null,null,null,null,null,11,44,"E00878","TCI PRO FLAT 30",43.5,null,null,null,null,null,null,null,null,"K","V10",null,35.299999999999997]
[null,null,null,null,null,null,45,50,"X","X","X",null,null,null,null,null,null,null,null,"L","V10",null,null,36.9]
[null,null,null,null,null,null,null,null,null,null,null,null,null,null,null,null,null,null,null,"M","V13",null,32.799999999999997]
[null,null,null,null,null,600,5,44,"E00878","TCI PRO FLAT 30",43.5,null,null,null,null,null,null,null,null,"N","V13",null,null,33.6]
[null,null,null,null,null,null,null,null,null,null,null,null,null,null,null,null,null,null,null,"O","Wallwasher x1",null,14.1]
[null,null,null,null,null,700,2,10.4,"KGP CC36W on/off","KGP CC36W on/off",34,null,null,null,null,null,null,null,null,"P","Wallwasher x2",null,28.1]
[null,null,null,null,null,null,10.5,44,"E00878","TCI PRO FLAT 30",43.5,null,null,null,null,null,null,null,null,"Q","Wallwasher x3",null,42.2]
[null,null,null,null,null,null,45,54,"E00967","TCI Aton 30",null,null,null,null,null,null,null,null,null,"R","Mini ring rim",null,35.299999999999997]
[null,null,null,null,null,null,null,null,null,null,null,null,null,null,null,null,null,null,null,"S","MidiRingRim",null,null,34.5]
[null,null,null,null,null,750,5,44,"E00878","TCI PRO FLAT 30",43.5,null,null,null,null,null,null,null,null,"T","Points-X5-GR (1szt)",null,null,14.7]
[null,null,null,null,null,null,null,null,null,null,null,null,null,null,null,null,null,null,null,"U","Points-X5-GR (2szt)",null,null,29.4]
[null,null,null,null,null,1050,5,38,"E01700","TCI PRO FLAT 40",43.4,null,null,null,null,null,null,null,null,"V","Points-X5-GR (3szt)",null,null,44.1]
[null,null,null,null,null,null,null,null,null,null,null,null,null,null,null,null,null,null,null,"W","Points-X5-DA",null,14.1]
[null,null,null,null,null,null,null,null,null,null,null,null,null,null,null,null,null,null,null,"X","ring",null,null,null,null,34]
[null,null,null,null,null,null,null,null,null,null,null,null,null,null,null,null,null,null,null,"Y","Rafter SQ 8",null,null,11.5]
[null,null,null,null,null,null,null,null,null,null,null,null,null,null,null,null,null,null,null,"Z","Rafter SQ 11",null,null,25.5]
[null,null,null,null,null,null,null,null,null,null,null,null,null,null,null,null,null,null,null,"AA","Rafter mini 14",null,null,17.399999999999999]
[null,null,null,null,null,null,null,null,null,null,null,null,null,null,null,null,null,null,null,"AB","Rafter mini 26",null,null,35.1]
[null,null,null,null,null,null,null,null,null,null,null,null,null,null,null,null,null,null,null,"AD","V6",null,8.6]
[]
["Rodzina","Kod 5-cyfrowy","Wersja mocy","Symbol","Nazwa","Ilość","kod mag","typ","Napięcie [V]","Prąd [mA]","Średnica otworu montażowego","Wysokość montażu","Zasilacz","Oznaczenie"]
["HOLLOW",38058,"M","38058-M930-xW-00-13","HOLLOW 6 LED recessed",1,"E00806","V8",16.7,350,56,90,{"$f":"_xlfn.IFNA(IF($K33>34,IF($J33=$F$3,VLOOKUP($I33,$G$3:$I$4,3,TRUE),IF($J33=$F$7,VLOOKUP($I33,$G$7:$I$9,3,TRUE),IF($J33=$F$11,VLOOKUP($I33,$G$11:$I$13,3,TRUE),IF($J33=$F$15,VLOOKUP($I33,$G$15:$I$15,3,TRUE),IF($J33=$F$17,VLOOKUP($I33,$G$17:$I$19,3,TRUE),IF($J33=$F$21,VLOOKUP($I33,$G$21:$I$21,3,TRUE),IF($J33=$F$23,VLOOKUP($I33,$G$23:$I$23,3,TRUE))))))))),0)","v":"E00878"},{"$f":"IF(AND(($U$2=H33),($Z$1=J33)),$T$2,IF(AND(($U$3=H33),($Z$1=J33)),$T$3,IF(AND(($U$4=H33),($X$1=J33)),$T$4,IF(AND(($U$5=H33),($W$1=J33)),$T$5,IF(AND(($U$6=H33),($X$1=J33)),$T$6,IF(AND(($U$7=H33),($V$1=J33)),$T$7,IF(AND(($U$8=H33),($W$1=J33)),$T$8,IF(AND(($U$9=H33),($X$1=J33)),$T$9,IF(AND(($U$10=H33),($W$1=J33)),$T$10,IF(AND(($U$11=H33),($V$1=J33)),$T$11,IF(AND(($U$12=H33),($W$1=J33)),$T$12,IF(AND(($U$13=H33),($X$1=J33)),$T$13,IF(AND(($U$14=H33),($W$1=J33)),$T$14,IF(AND(($U$15=H33),($X$1=J33)),$T$15,IF(AND(($U$16=H33),($W$1=J33)),$T$16,IF(AND(($U$17=H33),($W$1=J33)),$T$17,IF(AND(($U$18=H33),($W$1=J33)),$T$18,IF(AND(($U$19=H33),($W$1=J33)),$T$19,IF(AND(($U$20=H33),($X$1=J33)),$T$20,IF(AND(($U$21=H33),($X$1=J33)),$T$21,IF(AND(($U$22=H33),($X$1=J33)),$T$22,IF(AND(($U$23=H33),($X$1=J33)),$T$23,IF(AND(($U$24=H33),($W$1=J33)),$T$24,IF(AND(($U$25=H33),($Z$1=J33)),$T$25,IF(AND(($U$26=H33),($X$1=J33)),$T$26,IF(AND(($U$27=H33),($X$1=J33)),$T$27,IF(AND(($U$28=H33),($X$1=J33)),$T$28,IF(AND(($U$29=H33),($X$1=J33)),$T$29,))))))))))))))))))))))))))))","v":"G"}]
["HOLLOW",38060,"M","38060-M930-xW-00-13","HOLLOW 6 move LED recessed",1,"E00806","V8",16.7,350,56,90,"E00878",{"$f":"IF(AND(($U$2=H34),($Z$1=J34)),$T$2,IF(AND(($U$3=H34),($Z$1=J34)),$T$3,IF(AND(($U$4=H34),($X$1=J34)),$T$4,IF(AND(($U$5=H34),($W$1=J34)),$T$5,IF(AND(($U$6=H34),($X$1=J34)),$T$6,IF(AND(($U$7=H34),($V$1=J34)),$T$7,IF(AND(($U$8=H34),($W$1=J34)),$T$8,IF(AND(($U$9=H34),($X$1=J34)),$T$9,IF(AND(($U$10=H34),($W$1=J34)),$T$10,IF(AND(($U$11=H34),($V$1=J34)),$T$11,IF(AND(($U$12=H34),($W$1=J34)),$T$12,IF(AND(($U$13=H34),($X$1=J34)),$T$13,IF(AND(($U$14=H34),($W$1=J34)),$T$14,IF(AND(($U$15=H34),($X$1=J34)),$T$15,IF(AND(($U$16=H34),($W$1=J34)),$T$16,IF(AND(($U$17=H34),($W$1=J34)),$T$17,IF(AND(($U$18=H34),($W$1=J34)),$T$18,IF(AND(($U$19=H34),($W$1=J34)),$T$19,IF(AND(($U$20=H34),($X$1=J34)),$T$20,IF(AND(($U$21=H34),($X$1=J34)),$T$21,IF(AND(($U$22=H34),($X$1=J34)),$T$22,IF(AND(($U$23=H34),($X$1=J34)),$T$23,IF(AND(($U$24=H34),($W$1=J34)),$T$24,IF(AND(($U$25=H34),($Z$1=J34)),$T$25,IF(AND(($U$26=H34),($X$1=J34)),$T$26,IF(AND(($U$27=H34),($X$1=J34)),$T$27,IF(AND(($U$28=H34),($X$1=J34)),$T$28,IF(AND(($U$29=H34),($X$1=J34)),$T$29,))))))))))))))))))))))))))))","v":"G"}]
["HOLLOW",38051,"M","38051-M930-xW-00-13","HOLLOW 8 LED recessed",1,"E00806","V8",17.2,500,74,105,"E00878","H"]
["HOLLOW",38055,"M","38055-M930-xW-00-13","HOLLOW 8 lens LED recessed",1,"E00806","V8",17.2,350,74,65,"E00878","G"]
["HOLLOW",38057,"M","38057-M930-xW-00-13","HOLLOW 8 lens move LED recessed",1,"E00806","V8",17.2,350,74,65,"E00878","G"]
["HOLLOW",38053,"M","38053-M930-xW-00-13","HOLLOW 8 move LED recessed",1,"E00806","V8",17.2,500,74,105,"E00878","H"]
["HOLLOW",38011,"M","38011-M930-F1-00-12","HOLLOW micro LED hermetic M wpuszczany",1,"E01250","AQ-micro",3.4,700,35,85,"KGP CC36W on/off","A"]
["HOLLOW",37986,"M","37986-M930-F1-00-12","HOLLOW micro LED M wpuszczany",1,"E01250","AQ-micro",3.4,700,35,70,"KGP CC36W on/off","A"]
["HYPER",16447,"M","16447-M927-Z3-00-12","HYPER zoom LED G/K M reflektor",1,"E01732","V6-HD",35.299999999999997,250,50,55,"E01781","F"]
["LED EYE",30416,"M","30416-M940-F1-00-17","LED EYE hermetic M wpuszczany",1,"E00680","Vero10SE",25.1,350,92,70,"E00878","I"]
["MAXI POINT",26512,"M","26512-M927-D9-00-13","MAXI POINT round 13 LED G/K M kinkiet  ",1,"E01729","V6",8.6,500,55,55,"E01249","E"]
["MAXI POINT",26534,"M","26534-M927-D9-00-12","MAXI POINT round 8 LED G/K M kinkiet  ",1,"E01729","V6",8.6,500,55,55,"E01249","E"]
["MAXI POINT",26515,"M","26515-M927-D9-00-13","MAXI POINT square 12 LED G/K M kinkiet  ",1,"E01729","V6",8.6,500,55,55,"E01249","E"]
["MAXI POINT",26536,"M","26536-M927-D9-00-12","MAXI POINT square 8 LED G/K M kinkiet  ",1,"E01729","V6",8.6,500,55,55,"E01249","E",null," "]
["MIDI RING rim",38030,"M","38030-M930-D9-00-12","MIDI RING rim LED M wpuszczany  ",1,"E01604","MidiRingRim",34.5,500,210,55,"E00878","S"]
["MINI RING rim",38031,"M","38031-M930-D9-00-12","MINI RING rim LED M wpuszczany",1,"E01601","Mini ring rim",35.229999999999997,350,160,55,"E00878","R"]
["MODERN BALL",59874,"M","59874-M927-D0-00-12","MODERN BALL simple maxi WP LED G/K M zwieszany  ",1,"E00996","V13",32.799999999999997,350,50,55,"E00878","M"]
["MODERN BALL",59836,"M","59836-M927-D0-DA-13","MODERN BALL simple midi WP LED G/K M zwieszany  ",1,"E00678","V8",17.2,500,50,55,"E00878","H"]
["MODERN BALL",47001,"M","47001-M927-D0-00-12","MODERN BALL simple midi WP LED hermetic G/K M natynkowy  ",1,"E00678","V8",17.2,500,50,55,"E00878","H"]
["MODERN BALL",59875,"M","59875-M930-D0-00-16","MODERN BALL simple mini WP LED G/K M zwieszany ",1,"E00807","V8",16.7,350,50,55,"E00878","G"]
["MODERN BALL",47015,"M","47015-M927-D0-00-12","MODERN BALL simple mini WP LED hermetic G/K M natynkowy  ",1,"E00806","V8",16.7,350,50,55,"E00878","G"]
["MODERN GLASS mini",59877,"M","59877-M927-S1-00-06","MODERN GLASS mini 28 TP LED G/K M zwieszany ",1,"E01729","V6",8.6,500,50,55,"E01249","E"]
["MODERN GLASS mini",59878,"M","59878-M927-S1-00-06","MODERN GLASS mini 42 TP LED G/K M zwieszany ",1,"E01729","V6",8.6,500,50,55,"E01249","E"]
["MODERN GLASS",59879,"M","59879-M927-S1-00-06","MODERN GLASS mini 70 TP LED G/K M zwieszany ",1,"E01729","V6",8.6,500,50,55,"E01249","E"]
["MODERN GLASS",59831,"M","59831-M927-D9-DA-13","MODERN GLASS Tube TP LED G/K M9 zwieszany  ",1,"E01076","V10",34.200000000000003,250,50,55,"E01781","J"]
["MODERN GLASS",59833,"M","59833-M927-D9-DA-13","MODERN GLASS Tube TR LED G/K M zwieszany  ",1,"E01076","V10",34.200000000000003,250,50,55,"E01781","J"]
["MODERN GLASS mini",59910,"M","59910-M927-D9-00-12","MODERN GLASS Tube TS LED G/K M zwieszany  ",1,"E01076","V10",34.200000000000003,250,50,55,"E01781","J"]
["MODERN GLASS",59832,"M","59832-M927-D9-DA-13","MODERN GLASS Tube WP LED G/K M zwieszany  ",1,"E01076","V10",34.200000000000003,250,50,55,"E01781","J"]
["PET next",59825,"M","59825-M927-F1-00-06","PET midi 12 LED G/K M zwieszany ",1,"E01076","V10",34.200000000000003,250,50,55,"E01781","J"]
["PET next",59826,"M","59826-M927-F1-00-06","PET midi 20 LED G/K M zwieszany ",1,"E01076","V10",34.200000000000003,250,50,55,"E01781","J"]
["PET next",59827,"M","59827-M927-F1-00-06","PET midi 32 LED G/K M zwieszany ",1,"E01076","V10",34.200000000000003,250,50,55,"E01781","J"]
["PET next",16412,"M","16412-M927-F1-00-06","PET midi LED G/K M reflektor ",1,"E01076","V10",34.200000000000003,250,50,55,"E01781","J"]
["PET next",16414,"M","16414-M927-F1-00-06","PET maxi LED G/K M reflektor",1,"E00996","V13",33.6,500,50,55,"E00878","N"]
["PET next",59828,"M","59828-M927-S1-00-06","PET mini 12 LED G/K M zwieszany ",1,"E01729","V6",8.6,500,50,55,"E01249","E"]
["PET next",59829,"M","59829-M927-S1-00-06","PET mini 20 LED G/K M zwieszany ",1,"E01729","V6",8.6,500,50,55,"E01249","E"]
["PET next",59830,"M","59830-M927-S1-00-06","PET mini 32 LED G/K M zwieszany ",1,"E01729","V6",8.6,500,50,55,"E01249","E"]
["PET next",16413,"M","16413-M927-S1-00-06","PET mini LED G/K M reflektor ",1,"E01729","V6",8.6,500,50,55,"E01249","E"]
["PUTT",38017,"M","38017-M930-F1-00-13","PUTT maxi LED M wpuszczany  ",1,"E00997","V13",33.6,500,90,70,"E00878","N"]
["PUTT",38018,"M","38018-M930-S1-00-12","PUTT maxi LED trimless M wpuszczany",1,"E00996","V13",33.6,500,90,110,"E00878","N"]
["PUTT",38044,"M","38044-M930-F1-00-12","PUTT maxi move LED M wpuszczany  ",1,"E00997","V13",33.6,500,102,70,"E00878","N"]
["PUTT",38045,"M","38045-M930-F1-00-12","PUTT midi LED hermetic M wpuszczany",1,"E01077","V10",34.200000000000003,250,70,70,"E01781","J"]
["PUTT",38015,"M","38015-M930-F1-00-13","PUTT midi LED M wpuszczany  ",1,"E01077","V10",34.200000000000003,250,70,60,"E01781","J"]
["PUTT",38016,"M","38016-M930-F1-00-13","PUTT midi LED trimless M wpuszczany  ",1,"E01077","V10",34.200000000000003,250,70,90,"E01781","J"]
["PUTT",38047,"M","38047-M930-F1-00-12","PUTT midi move LED M hermetic wpuszczany  ",1,"E01077","V10",34.200000000000003,250,65,70,"E01781","J"]
["PUTT",38042,"M","38042-M930-W1-00-12","PUTT midi move LED M wpuszczany  ",1,"E01077","V10",34.200000000000003,250,80,80,"E01781","J"]
["PUTT",38043,"M","38043-M930-W1-00-12","PUTT midi move LED trimless M wpuszczany  ",1,"E01077","V10",34.200000000000003,250,85,85,"E01781","J"]
["PUTT",38046,"M","38046-M930-S1-00-12","PUTT mini LED M hermetic wpuszczany ",1,"E01730","V6",8.6,500,50,65,"E01249","E"]
["PUTT",38013,"M","38013-M927-S1-00-06","PUTT mini LED M wpuszczany ",1,"E01729","V6",8.6,500,50,50,"E01249","E"]
["PUTT",38014,"M","38017-M930-S1-00-12","PUTT mini LED trimless M wpuszczany  ",1,"E01730","V6",8.6,500,50,70,"E01249","E"]
["RAFTER",16416,"M","16416-M927-FW-00-12","RAFTER points 14 LED G/K  M reflektor   ",1,"E01252","Points-X5-DA",14.1,350,50,55,"E00878","W"]
["RAFTER",37973,"M","37973-M927-FW-00-12","RAFTER points 15 LED trim M wpuszczany   ",1,"E01052","Points-X5-GR (1szt)",14.7,500,138,70,"E00878","T"]
["RAFTER",37974,"M","37974-M927-FW-00-12","RAFTER points 28 LED trim M wpuszczany   ",2,"E01052","Points-X5-GR (2szt)",29.4,500,271,70,"E00878","U"]
["RAFTER",37975,"M","37975-M927-FW-00-12","RAFTER points 41 LED trim M wpuszczany   ",3,"E01052","Points-X5-GR (3szt)",44.1,500,403,70,"E00878","V"]
["RAFTER",37970,"M","37970-M927-FW-00-12","RAFTER points 5 LED trim M wpuszczany   ",1,"E01033","Points-X1-GR (1szt)",2.9,700,35,70,"KGP CC36W on/off","B"]
["RAFTER",37972,"M","37972-M927-FW-00-12","RAFTER points 8 LED trim M wpuszczany ",2,"E01033","Points-X1-GR (2szt)",5.8,500,65,70,"E01249","C"]
["RAFTER",16420,"M","16420-M927-FB-00-12","RAFTER points 9 LED G/K M reflektor   ",3,"E01033","Points-X1-GR (3szt)",8.5,350,50,55,"E00763","D"]
["RAFTER",37976,"L","37976-L927-R1-00-19","RAFTER wall washer 15 LED trim L wpuszczany  ",1,"E01055","Wallwasher x1",14.1,350,138,70,"E00878","O"]
["RAFTER",37977,"L","37977-L927-R1-00-19","RAFTER wall washer 28 LED trim L wpuszczany  ",2,"E01055","Wallwasher x2",28.1,350,271,70,"E00878","P"]
["RAFTER",37978,"L","37978-L927-R1-00-19","RAFTER wall washer 41 LED trim L wpuszczany  ",3,"E01055","Wallwasher x3",42.2,350,403,70,"E00878","Q"]
["SIRCA",37988,"M","37988-M930-WW-00-13","SIRCA 10 LED M wpuszczany   ",1,"E01077","V10",34.200000000000003,250,95,45,"E01781","J"]
["SIRCA",37989,"M","37989-M930-WW-00-13","SIRCA 14 LED M wpuszczany   ",1,"E01077","V10",35.299999999999997,350,125,55,"E00878","K"]
["SIRCA",38034,"M","38034-M930-WB-00-12","SIRCA 16 LED M wpuszczany   ",1,"E01077","V10",36.9,500,150,65,"E00878","L"]
["SQUARES 111",37979,"M","37979-M930-F1-00-12","SQUARES next 50x1 LED M wpuszczany  ",1,"E01272","V8",16.7,350,112,85,{"$f":"_xlfn.IFNA(IF($K95>34,IF($J95=$F$3,VLOOKUP($I95,$G$3:$I$4,3,TRUE),IF($J95=$F$7,VLOOKUP($I95,$G$7:$I$9,3,TRUE),IF($J95=$F$11,VLOOKUP($I95,$G$11:$I$13,3,TRUE),IF($J95=$F$15,VLOOKUP($I95,$G$15:$I$15,3,TRUE),IF($J95=$F$17,VLOOKUP($I95,$G$17:$I$19,3,TRUE),IF($J95=$F$21,VLOOKUP($I95,$G$21:$I$21,3,TRUE),IF($J95=$F$23,VLOOKUP($I95,$G$23:$I$23,3,TRUE))))))))),0)","v":"E00878"},"G"]
["SQUARES next",37990,"M","37990-M930-F1-00-12","SQUARES next 50x1 LED trimless M wpuszczany  ",1,"E01272","V8",16.7,350,105,85,"E00878",{"$f":"IF(AND(($U$2=H96),($Z$1=J96)),$T$2,IF(AND(($U$3=H96),($Z$1=J96)),$T$3,IF(AND(($U$4=H96),($X$1=J96)),$T$4,IF(AND(($U$5=H96),($W$1=J96)),$T$5,IF(AND(($U$6=H96),($X$1=J96)),$T$6,IF(AND(($U$7=H96),($V$1=J96)),$T$7,IF(AND(($U$8=H96),($W$1=J96)),$T$8,IF(AND(($U$9=H96),($X$1=J96)),$T$9,IF(AND(($U$10=H96),($W$1=J96)),$T$10,IF(AND(($U$11=H96),($V$1=J96)),$T$11,IF(AND(($U$12=H96),($W$1=J96)),$T$12,IF(AND(($U$13=H96),($X$1=J96)),$T$13,IF(AND(($U$14=H96),($W$1=J96)),$T$14,IF(AND(($U$15=H96),($X$1=J96)),$T$15,IF(AND(($U$16=H96),($W$1=J96)),$T$16,IF(AND(($U$17=H96),($W$1=J96)),$T$17,IF(AND(($U$18=H96),($W$1=J96)),$T$18,IF(AND(($U$19=H96),($W$1=J96)),$T$19,IF(AND(($U$20=H96),($X$1=J96)),$T$20,IF(AND(($U$21=H96),($X$1=J96)),$T$21,IF(AND(($U$22=H96),($X$1=J96)),$T$22,IF(AND(($U$23=H96),($X$1=J96)),$T$23,IF(AND(($U$24=H96),($W$1=J96)),$T$24,IF(AND(($U$25=H96),($Z$1=J96)),$T$25,IF(AND(($U$26=H96),($X$1=J96)),$T$26,IF(AND(($U$27=H96),($X$1=J96)),$T$27,IF(AND(($U$28=H96),($X$1=J96)),$T$28,IF(AND(($U$29=H96),($X$1=J96)),$T$29,))))))))))))))))))))))))))))","v":"G"}]
["SQUARES 111",37980,"M","37980-M930-F1-00-12","SQUARES next 50x2 LED M wpuszczany  ",2,"E01272","V8",33.4,350,210,85,"E00878","G"]
["SQUARES next",37991,"M","37991-M930-F1-00-12","SQUARES next 50x2 LED trimless M wpuszczany  ",2,"E01272","V8",33.4,350,207,85,"E00878","G"]
["SWING",38035,"M","38035-M927-F1-00-12","SWING next LED M wpuszczany  ",1,"E01759","V10",35.299999999999997,350,78,90,"E00878","K"]
["SWING",38036,"M","38036-M927-F1-00-12","SWING next LED trimless M wpuszczany  ",1,"E01759","V10",35.299999999999997,350,80,90,"E00878","K"]
["QRLED",38061,"M",null,"QRLED next x1 trim recessed",null,"E01272","V8",17.2,500,35,null,"E00878","H"]
["QRLED",38062,"M",null,"QRLED next x1 trimless recessed",null,"E01272","V8",17.2,500,35,null,"E00878","H"]
["QRLED",38063,"M",null,"QRLED next move trim recessed",null,"E01272","V8",17.2,500,35,null,"E00878","H"]
["QRLED",38064,"M",null,"QRLED next move trimless recessed",null,"E01272","V8",17.2,500,35,null,"E00878","H"]
["QRLED",16480,"M",null,"QRLED next G/K spot",null,"E01272","V8",17.2,500,35,null,{"$f":"_xlfn.IFNA(IF($K105>34,IF($J105=$F$3,VLOOKUP($I105,$G$3:$I$4,3,TRUE),IF($J105=$F$7,VLOOKUP($I105,$G$7:$I$9,3,TRUE),IF($J105=$F$11,VLOOKUP($I105,$G$11:$I$13,3,TRUE),IF($J105=$F$15,VLOOKUP($I105,$G$15:$I$15,3,TRUE),IF($J105=$F$17,VLOOKUP($I105,$G$17:$I$19,3,TRUE),IF($J105=$F$21,VLOOKUP($I105,$G$21:$I$21,3,TRUE),IF($J105=$F$23,VLOOKUP($I105,$G$23:$I$23,3,TRUE))))))))),0)","v":"E00878"},"H"]
["RAFTER",38065,"M",null,"RAFTER mini points move 14 LED recessed",null,null,"Rafter mini 14",17.399999999999999,500,335,null,"E00878","AA"]
["RAFTER",38066,"M",null,"RAFTER mini points move 26 LED recessed",null,null,"Rafter mini 26",35.1,500,35,null,"E00878","AB"]
["RAFTER",38067,"M",null,"RAFTER points 11 SQ LED trim recessed",null,null,"Rafter SQ 11",25.5,500,35,null,"E00878","Z"]
["RAFTER",38068,"M",null,"RAFTER points 8 SQ LED trim recessed",null,null,"Rafter SQ 8",11.5,500,35,null,"E00878","Y"]
["Triba",16476,"M",null,"TRIBA mini LED G/K spot",1,"E01729","V6",8.6,500,50,55,{"$f":"_xlfn.IFNA(IF($K110>34,IF($J110=$F$3,VLOOKUP($I110,$G$3:$I$4,3,TRUE),IF($J110=$F$7,VLOOKUP($I110,$G$7:$I$9,3,TRUE),IF($J110=$F$11,VLOOKUP($I110,$G$11:$I$13,3,TRUE),IF($J110=$F$15,VLOOKUP($I110,$G$15:$I$15,3,TRUE),IF($J110=$F$17,VLOOKUP($I110,$G$17:$I$19,3,TRUE),IF($J110=$F$21,VLOOKUP($I110,$G$21:$I$21,3,TRUE),IF($J110=$F$23,VLOOKUP($I110,$G$23:$I$23,3,TRUE))))))))),0)","v":"E01249"},"E"]
["Triba",16478,"M",null,"\tTRIBA midi LED G/K spot",1,"E01077","V10",34.200000000000003,250,50,55,{"$f":"_xlfn.IFNA(IF($K111>34,IF($J111=$F$3,VLOOKUP($I111,$G$3:$I$4,3,TRUE),IF($J111=$F$7,VLOOKUP($I111,$G$7:$I$9,3,TRUE),IF($J111=$F$11,VLOOKUP($I111,$G$11:$I$13,3,TRUE),IF($J111=$F$15,VLOOKUP($I111,$G$15:$I$15,3,TRUE),IF($J111=$F$17,VLOOKUP($I111,$G$17:$I$19,3,TRUE),IF($J111=$F$21,VLOOKUP($I111,$G$21:$I$21,3,TRUE),IF($J111=$F$23,VLOOKUP($I111,$G$23:$I$23,3,TRUE))))))))),0)","v":"E01781"},{"$f":"IF(AND(($U$2=H111),($Z$1=J111)),$T$2,IF(AND(($U$3=H111),($Z$1=J111)),$T$3,IF(AND(($U$4=H111),($X$1=J111)),$T$4,IF(AND(($U$5=H111),($W$1=J111)),$T$5,IF(AND(($U$6=H111),($X$1=J111)),$T$6,IF(AND(($U$7=H111),($V$1=J111)),$T$7,IF(AND(($U$8=H111),($W$1=J111)),$T$8,IF(AND(($U$9=H111),($X$1=J111)),$T$9,IF(AND(($U$10=H111),($W$1=J111)),$T$10,IF(AND(($U$11=H111),($V$1=J111)),$T$11,IF(AND(($U$12=H111),($W$1=J111)),$T$12,IF(AND(($U$13=H111),($X$1=J111)),$T$13,IF(AND(($U$14=H111),($W$1=J111)),$T$14,IF(AND(($U$15=H111),($X$1=J111)),$T$15,IF(AND(($U$16=H111),($W$1=J111)),$T$16,IF(AND(($U$17=H111),($W$1=J111)),$T$17,IF(AND(($U$18=H111),($W$1=J111)),$T$18,IF(AND(($U$19=H111),($W$1=J111)),$T$19,IF(AND(($U$20=H111),($X$1=J111)),$T$20,IF(AND(($U$21=H111),($X$1=J111)),$T$21,IF(AND(($U$22=H111),($X$1=J111)),$T$22,IF(AND(($U$23=H111),($X$1=J111)),$T$23,IF(AND(($U$24=H111),($W$1=J111)),$T$24,IF(AND(($U$25=H111),($Z$1=J111)),$T$25,IF(AND(($U$26=H111),($X$1=J111)),$T$26,IF(AND(($U$27=H111),($X$1=J111)),$T$27,IF(AND(($U$28=H111),($X$1=J111)),$T$28,IF(AND(($U$29=H111),($X$1=J111)),$T$29,))))))))))))))))))))))))))))","v":"J"}]
["Pocket mini",20145,null,"20145-M930-D0-00-12","POCKET mini LED kinkiet",1,"E01729","V6",8.6,350,50,null,{"$f":"_xlfn.IFNA(IF($K112>34,IF($J112=$F$3,VLOOKUP($I112,$G$3:$I$4,3,TRUE),IF($J112=$F$7,VLOOKUP($I112,$G$7:$I$9,3,TRUE),IF($J112=$F$11,VLOOKUP($I112,$G$11:$I$13,3,TRUE),IF($J112=$F$15,VLOOKUP($I112,$G$15:$I$15,3,TRUE),IF($J112=$F$17,VLOOKUP($I112,$G$17:$I$19,3,TRUE),IF($J112=$F$21,VLOOKUP($I112,$G$21:$I$21,3,TRUE),IF($J112=$F$23,VLOOKUP($I112,$G$23:$I$23,3,TRUE))))))))),0)","v":"E00763"},{"$f":"IF(AND(($U$2=H112),($Z$1=J112)),$T$2,IF(AND(($U$3=H112),($Z$1=J112)),$T$3,IF(AND(($U$4=H112),($X$1=J112)),$T$4,IF(AND(($U$5=H112),($W$1=J112)),$T$5,IF(AND(($U$6=H112),($X$1=J112)),$T$6,IF(AND(($U$7=H112),($V$1=J112)),$T$7,IF(AND(($U$8=H112),($W$1=J112)),$T$8,IF(AND(($U$9=H112),($X$1=J112)),$T$9,IF(AND(($U$10=H112),($W$1=J112)),$T$10,IF(AND(($U$11=H112),($V$1=J112)),$T$11,IF(AND(($U$12=H112),($W$1=J112)),$T$12,IF(AND(($U$13=H112),($X$1=J112)),$T$13,IF(AND(($U$14=H112),($W$1=J112)),$T$14,IF(AND(($U$15=H112),($X$1=J112)),$T$15,IF(AND(($U$16=H112),($W$1=J112)),$T$16,IF(AND(($U$17=H112),($W$1=J112)),$T$17,IF(AND(($U$18=H112),($W$1=J112)),$T$18,IF(AND(($U$19=H112),($W$1=J112)),$T$19,IF(AND(($U$20=H112),($X$1=J112)),$T$20,IF(AND(($U$21=H112),($X$1=J112)),$T$21,IF(AND(($U$22=H112),($X$1=J112)),$T$22,IF(AND(($U$23=H112),($X$1=J112)),$T$23,IF(AND(($U$24=H112),($W$1=J112)),$T$24,IF(AND(($U$25=H112),($Z$1=J112)),$T$25,IF(AND(($U$26=H112),($X$1=J112)),$T$26,IF(AND(($U$27=H112),($X$1=J112)),$T$27,IF(AND(($U$28=H112),($X$1=J112)),$T$28,IF(AND(($U$29=H112),($X$1=J112)),$T$29,IF(AND(($U$30=H112),($W$1=J112)),$T$30,)))))))))))))))))))))))))))))","v":"AD"}]
["MAXI POINT",26514,null,null,"MAXI POINT round 13 LED wall",1,"E01729","V6",8.6,500,60,null,{"$f":"_xlfn.IFNA(IF($K113>34,IF($J113=$F$3,VLOOKUP($I113,$G$3:$I$4,3,TRUE),IF($J113=$F$7,VLOOKUP($I113,$G$7:$I$9,3,TRUE),IF($J113=$F$11,VLOOKUP($I113,$G$11:$I$13,3,TRUE),IF($J113=$F$15,VLOOKUP($I113,$G$15:$I$15,3,TRUE),IF($J113=$F$17,VLOOKUP($I113,$G$17:$I$19,3,TRUE),IF($J113=$F$21,VLOOKUP($I113,$G$21:$I$21,3,TRUE),IF($J113=$F$23,VLOOKUP($I113,$G$23:$I$23,3,TRUE))))))))),0)","v":"E01249"},{"$f":"IF(AND(($U$2=H113),($Z$1=J113)),$T$2,IF(AND(($U$3=H113),($Z$1=J113)),$T$3,IF(AND(($U$4=H113),($X$1=J113)),$T$4,IF(AND(($U$5=H113),($W$1=J113)),$T$5,IF(AND(($U$6=H113),($X$1=J113)),$T$6,IF(AND(($U$7=H113),($V$1=J113)),$T$7,IF(AND(($U$8=H113),($W$1=J113)),$T$8,IF(AND(($U$9=H113),($X$1=J113)),$T$9,IF(AND(($U$10=H113),($W$1=J113)),$T$10,IF(AND(($U$11=H113),($V$1=J113)),$T$11,IF(AND(($U$12=H113),($W$1=J113)),$T$12,IF(AND(($U$13=H113),($X$1=J113)),$T$13,IF(AND(($U$14=H113),($W$1=J113)),$T$14,IF(AND(($U$15=H113),($X$1=J113)),$T$15,IF(AND(($U$16=H113),($W$1=J113)),$T$16,IF(AND(($U$17=H113),($W$1=J113)),$T$17,IF(AND(($U$18=H113),($W$1=J113)),$T$18,IF(AND(($U$19=H113),($W$1=J113)),$T$19,IF(AND(($U$20=H113),($X$1=J113)),$T$20,IF(AND(($U$21=H113),($X$1=J113)),$T$21,IF(AND(($U$22=H113),($X$1=J113)),$T$22,IF(AND(($U$23=H113),($X$1=J113)),$T$23,IF(AND(($U$24=H113),($W$1=J113)),$T$24,IF(AND(($U$25=H113),($Z$1=J113)),$T$25,IF(AND(($U$26=H113),($X$1=J113)),$T$26,IF(AND(($U$27=H113),($X$1=J113)),$T$27,IF(AND(($U$28=H113),($X$1=J113)),$T$28,IF(AND(($U$29=H113),($X$1=J113)),$T$29,IF(AND(($U$30=H113),($W$1=J113)),$T$30,)))))))))))))))))))))))))))))","v":"E"}]
["MAXI POINT",26535,null,null,"MAXI POINT round 8 LED wall",1,"E01729","V6",8.6,500,60,null,{"$f":"_xlfn.IFNA(IF($K114>34,IF($J114=$F$3,VLOOKUP($I114,$G$3:$I$4,3,TRUE),IF($J114=$F$7,VLOOKUP($I114,$G$7:$I$9,3,TRUE),IF($J114=$F$11,VLOOKUP($I114,$G$11:$I$13,3,TRUE),IF($J114=$F$15,VLOOKUP($I114,$G$15:$I$15,3,TRUE),IF($J114=$F$17,VLOOKUP($I114,$G$17:$I$19,3,TRUE),IF($J114=$F$21,VLOOKUP($I114,$G$21:$I$21,3,TRUE),IF($J114=$F$23,VLOOKUP($I114,$G$23:$I$23,3,TRUE))))))))),0)","v":"E01249"},"E"]
["MAXI POINT",26517,null,null,"MAXI POINT square 12 LED wall",1,"E01729","V6",8.6,500,60,null,{"$f":"_xlfn.IFNA(IF($K115>34,IF($J115=$F$3,VLOOKUP($I115,$G$3:$I$4,3,TRUE),IF($J115=$F$7,VLOOKUP($I115,$G$7:$I$9,3,TRUE),IF($J115=$F$11,VLOOKUP($I115,$G$11:$I$13,3,TRUE),IF($J115=$F$15,VLOOKUP($I115,$G$15:$I$15,3,TRUE),IF($J115=$F$17,VLOOKUP($I115,$G$17:$I$19,3,TRUE),IF($J115=$F$21,VLOOKUP($I115,$G$21:$I$21,3,TRUE),IF($J115=$F$23,VLOOKUP($I115,$G$23:$I$23,3,TRUE))))))))),0)","v":"E01249"},"E"]
["MAXI POINT",26537,null,null,"MAXI POINT square 8 LED wall",1,"E01729","V6",8.6,500,60,null,"E01249",{"$f":"IF(AND(($U$2=H116),($Z$1=J116)),$T$2,IF(AND(($U$3=H116),($Z$1=J116)),$T$3,IF(AND(($U$4=H116),($X$1=J116)),$T$4,IF(AND(($U$5=H116),($W$1=J116)),$T$5,IF(AND(($U$6=H116),($X$1=J116)),$T$6,IF(AND(($U$7=H116),($V$1=J116)),$T$7,IF(AND(($U$8=H116),($W$1=J116)),$T$8,IF(AND(($U$9=H116),($X$1=J116)),$T$9,IF(AND(($U$10=H116),($W$1=J116)),$T$10,IF(AND(($U$11=H116),($V$1=J116)),$T$11,IF(AND(($U$12=H116),($W$1=J116)),$T$12,IF(AND(($U$13=H116),($X$1=J116)),$T$13,IF(AND(($U$14=H116),($W$1=J116)),$T$14,IF(AND(($U$15=H116),($X$1=J116)),$T$15,IF(AND(($U$16=H116),($W$1=J116)),$T$16,IF(AND(($U$17=H116),($W$1=J116)),$T$17,IF(AND(($U$18=H116),($W$1=J116)),$T$18,IF(AND(($U$19=H116),($W$1=J116)),$T$19,IF(AND(($U$20=H116),($X$1=J116)),$T$20,IF(AND(($U$21=H116),($X$1=J116)),$T$21,IF(AND(($U$22=H116),($X$1=J116)),$T$22,IF(AND(($U$23=H116),($X$1=J116)),$T$23,IF(AND(($U$24=H116),($W$1=J116)),$T$24,IF(AND(($U$25=H116),($Z$1=J116)),$T$25,IF(AND(($U$26=H116),($X$1=J116)),$T$26,IF(AND(($U$27=H116),($X$1=J116)),$T$27,IF(AND(($U$28=H116),($X$1=J116)),$T$28,IF(AND(($U$29=H116),($X$1=J116)),$T$29,IF(AND(($U$30=H116),($W$1=J116)),$T$30,)))))))))))))))))))))))))))))","v":"E"}]
[null,null,null,null,null,null,"`"]
[]
[]
[]
[]
[]
[]
[]
[]
[]
[]
[]
[]
[]
[]
[]
[]
[]
[]
[]
[]
[]
[]
[]
[]
[]
[]
[]
[]
[]
[]
[]
[]
[]
[]
[]
[]
[]
[]
[]
[]
[]
[null,null,null,null,null,null,null,null,null,null,null,null,null,{"$f":"IF(AND(($U$36=H110),($Z$35=J110)),$T$36,IF(AND(($U$37=$H$33),($W$35=J110)),$T$37,IF(AND(($U$38=H110),($Z$35=J110)),$T$38,IF(AND(($U$39=H110),($V$35=J110)),$T$39,IF(AND(($U$40=H110),($X$35=J110)),$T$40,IF(AND(($U$41=H110),($X$35=J110)),$T$41,IF(AND(($U$42=H110),($V$35=J110)),$T$42,IF(AND(($U$43=H110),($V$35=J110)),$T$43,IF(AND(($U$44=H110),($W$35=J110)),$T$44,IF(AND(($U$45=H110),($X$35=J110)),$T$45,IF(AND(($U$46=H110),($V$35=J110)),$T$46,IF(AND(($U$48=H110),($W$35=J110)),$T$48,IF(AND(($U$49=H110),($V$35=J110)),$T$49,IF(AND(($U$50=H110),($W$35=J110)),$T$50,IF(AND(($U$51=H110),($X$35=J110)),$T$51,IF(AND(($U$52=H110),($V$35=J110)),$T$52,IF(AND(($U$53=H110),($W$35=J110)),$T$53,IF(AND(($U$54=H110),($X$35=J110)),$T$54,IF(AND(($U$55=H110),($Y$35=J110)),$T$55,IF(AND(($U$56=H110),($W$35=J110)),$T$56,IF(AND((#REF!=H110),($W$35=J110)),#REF!,IF(AND(($U$57=H110),($W$35=J110)),$T$57,IF(AND(($U$58=H110),($W$35=J110)),$T$58,IF(AND(($U$59=H110),($X$35=J110)),$T$59,IF(AND(($U$60=H110),($W$35=J110)),$T$60,IF(AND(($U$61=H110),($V$35=J110)),$T$61,IF(AND(($U$62=H110),($X$35=J110)),$T$62,IF(AND(($U$63=H110),($V$35=J110)),$T$63,IF(AND(($U$64=H110),($X$35=J110)),$T$64,IF(AND(($U$65=H110),($V$35=J110)),$T$65,IF(AND(($U$66=H110),($X$35=J110)),$T$66,IF(AND(($U$67=H110),($W$35=J110)),$T$67,IF(AND(($U$68=H110),($X$35=J110)),$T$68,IF(AND(($U$69=H110),(W$35=J110)),$T$69,\"\"))))))))))))))))))))))))))))))))))","v":{"$error":"#REF!"}}]
[null,null,null,null,null,null,null,null,null,null,null,null,null,{"$f":"IF(AND(($U$36=H111),($Z$35=J111)),$T$36,IF(AND(($U$37=$H$33),($W$35=J111)),$T$37,IF(AND(($U$38=H111),($Z$35=J111)),$T$38,IF(AND(($U$39=H111),($V$35=J111)),$T$39,IF(AND(($U$40=H111),($X$35=J111)),$T$40,IF(AND(($U$41=H111),($X$35=J111)),$T$41,IF(AND(($U$42=H111),($V$35=J111)),$T$42,IF(AND(($U$43=H111),($V$35=J111)),$T$43,IF(AND(($U$44=H111),($W$35=J111)),$T$44,IF(AND(($U$45=H111),($X$35=J111)),$T$45,IF(AND(($U$46=H111),($V$35=J111)),$T$46,IF(AND(($U$48=H111),($W$35=J111)),$T$48,IF(AND(($U$49=H111),($V$35=J111)),$T$49,IF(AND(($U$50=H111),($W$35=J111)),$T$50,IF(AND(($U$51=H111),($X$35=J111)),$T$51,IF(AND(($U$52=H111),($V$35=J111)),$T$52,IF(AND(($U$53=H111),($W$35=J111)),$T$53,IF(AND(($U$54=H111),($X$35=J111)),$T$54,IF(AND(($U$55=H111),($Y$35=J111)),$T$55,IF(AND(($U$56=H111),($W$35=J111)),$T$56,IF(AND((#REF!=H111),($W$35=J111)),#REF!,IF(AND(($U$57=H111),($W$35=J111)),$T$57,IF(AND(($U$58=H111),($W$35=J111)),$T$58,IF(AND(($U$59=H111),($X$35=J111)),$T$59,IF(AND(($U$60=H111),($W$35=J111)),$T$60,IF(AND(($U$61=H111),($V$35=J111)),$T$61,IF(AND(($U$62=H111),($X$35=J111)),$T$62,IF(AND(($U$63=H111),($V$35=J111)),$T$63,IF(AND(($U$64=H111),($X$35=J111)),$T$64,IF(AND(($U$65=H111),($V$35=J111)),$T$65,IF(AND(($U$66=H111),($X$35=J111)),$T$66,IF(AND(($U$67=H111),($W$35=J111)),$T$67,IF(AND(($U$68=H111),($X$35=J111)),$T$68,IF(AND(($U$69=H111),(W$35=J111)),$T$69,\"\"))))))))))))))))))))))))))))))))))","v":{"$error":"#REF!"}}]
[null,null,null,null,null,null,null,null,null,null,null,null,null,{"$f":"IF(AND(($U$36=H112),($Z$35=J112)),$T$36,IF(AND(($U$37=$H$33),($W$35=J112)),$T$37,IF(AND(($U$38=H112),($Z$35=J112)),$T$38,IF(AND(($U$39=H112),($V$35=J112)),$T$39,IF(AND(($U$40=H112),($X$35=J112)),$T$40,IF(AND(($U$41=H112),($X$35=J112)),$T$41,IF(AND(($U$42=H112),($V$35=J112)),$T$42,IF(AND(($U$43=H112),($V$35=J112)),$T$43,IF(AND(($U$44=H112),($W$35=J112)),$T$44,IF(AND(($U$45=H112),($X$35=J112)),$T$45,IF(AND(($U$46=H112),($V$35=J112)),$T$46,IF(AND(($U$48=H112),($W$35=J112)),$T$48,IF(AND(($U$49=H112),($V$35=J112)),$T$49,IF(AND(($U$50=H112),($W$35=J112)),$T$50,IF(AND(($U$51=H112),($X$35=J112)),$T$51,IF(AND(($U$52=H112),($V$35=J112)),$T$52,IF(AND(($U$53=H112),($W$35=J112)),$T$53,IF(AND(($U$54=H112),($X$35=J112)),$T$54,IF(AND(($U$55=H112),($Y$35=J112)),$T$55,IF(AND(($U$56=H112),($W$35=J112)),$T$56,IF(AND((#REF!=H112),($W$35=J112)),#REF!,IF(AND(($U$57=H112),($W$35=J112)),$T$57,IF(AND(($U$58=H112),($W$35=J112)),$T$58,IF(AND(($U$59=H112),($X$35=J112)),$T$59,IF(AND(($U$60=H112),($W$35=J112)),$T$60,IF(AND(($U$61=H112),($V$35=J112)),$T$61,IF(AND(($U$62=H112),($X$35=J112)),$T$62,IF(AND(($U$63=H112),($V$35=J112)),$T$63,IF(AND(($U$64=H112),($X$35=J112)),$T$64,IF(AND(($U$65=H112),($V$35=J112)),$T$65,IF(AND(($U$66=H112),($X$35=J112)),$T$66,IF(AND(($U$67=H112),($W$35=J112)),$T$67,IF(AND(($U$68=H112),($X$35=J112)),$T$68,IF(AND(($U$69=H112),(W$35=J112)),$T$69,\"\"))))))))))))))))))))))))))))))))))","v":{"$error":"#REF!"}}]
[null,null,null,null,null,null,null,null,null,null,null,null,null,{"$f":"IF(AND(($U$36=H113),($Z$35=J113)),$T$36,IF(AND(($U$37=$H$33),($W$35=J113)),$T$37,IF(AND(($U$38=H113),($Z$35=J113)),$T$38,IF(AND(($U$39=H113),($V$35=J113)),$T$39,IF(AND(($U$40=H113),($X$35=J113)),$T$40,IF(AND(($U$41=H113),($X$35=J113)),$T$41,IF(AND(($U$42=H113),($V$35=J113)),$T$42,IF(AND(($U$43=H113),($V$35=J113)),$T$43,IF(AND(($U$44=H113),($W$35=J113)),$T$44,IF(AND(($U$45=H113),($X$35=J113)),$T$45,IF(AND(($U$46=H113),($V$35=J113)),$T$46,IF(AND(($U$48=H113),($W$35=J113)),$T$48,IF(AND(($U$49=H113),($V$35=J113)),$T$49,IF(AND(($U$50=H113),($W$35=J113)),$T$50,IF(AND(($U$51=H113),($X$35=J113)),$T$51,IF(AND(($U$52=H113),($V$35=J113)),$T$52,IF(AND(($U$53=H113),($W$35=J113)),$T$53,IF(AND(($U$54=H113),($X$35=J113)),$T$54,IF(AND(($U$55=H113),($Y$35=J113)),$T$55,IF(AND(($U$56=H113),($W$35=J113)),$T$56,IF(AND((#REF!=H113),($W$35=J113)),#REF!,IF(AND(($U$57=H113),($W$35=J113)),$T$57,IF(AND(($U$58=H113),($W$35=J113)),$T$58,IF(AND(($U$59=H113),($X$35=J113)),$T$59,IF(AND(($U$60=H113),($W$35=J113)),$T$60,IF(AND(($U$61=H113),($V$35=J113)),$T$61,IF(AND(($U$62=H113),($X$35=J113)),$T$62,IF(AND(($U$63=H113),($V$35=J113)),$T$63,IF(AND(($U$64=H113),($X$35=J113)),$T$64,IF(AND(($U$65=H113),($V$35=J113)),$T$65,IF(AND(($U$66=H113),($X$35=J113)),$T$66,IF(AND(($U$67=H113),($W$35=J113)),$T$67,IF(AND(($U$68=H113),($X$35=J113)),$T$68,IF(AND(($U$69=H113),(W$35=J113)),$T$69,\"\"))))))))))))))))))))))))))))))))))","v":{"$error":"#REF!"}}]
[null,null,null,null,null,null,null,null,null,null,null,null,null,{"$f":"IF(AND(($U$36=H114),($Z$35=J114)),$T$36,IF(AND(($U$37=$H$33),($W$35=J114)),$T$37,IF(AND(($U$38=H114),($Z$35=J114)),$T$38,IF(AND(($U$39=H114),($V$35=J114)),$T$39,IF(AND(($U$40=H114),($X$35=J114)),$T$40,IF(AND(($U$41=H114),($X$35=J114)),$T$41,IF(AND(($U$42=H114),($V$35=J114)),$T$42,IF(AND(($U$43=H114),($V$35=J114)),$T$43,IF(AND(($U$44=H114),($W$35=J114)),$T$44,IF(AND(($U$45=H114),($X$35=J114)),$T$45,IF(AND(($U$46=H114),($V$35=J114)),$T$46,IF(AND(($U$48=H114),($W$35=J114)),$T$48,IF(AND(($U$49=H114),($V$35=J114)),$T$49,IF(AND(($U$50=H114),($W$35=J114)),$T$50,IF(AND(($U$51=H114),($X$35=J114)),$T$51,IF(AND(($U$52=H114),($V$35=J114)),$T$52,IF(AND(($U$53=H114),($W$35=J114)),$T$53,IF(AND(($U$54=H114),($X$35=J114)),$T$54,IF(AND(($U$55=H114),($Y$35=J114)),$T$55,IF(AND(($U$56=H114),($W$35=J114)),$T$56,IF(AND((#REF!=H114),($W$35=J114)),#REF!,IF(AND(($U$57=H114),($W$35=J114)),$T$57,IF(AND(($U$58=H114),($W$35=J114)),$T$58,IF(AND(($U$59=H114),($X$35=J114)),$T$59,IF(AND(($U$60=H114),($W$35=J114)),$T$60,IF(AND(($U$61=H114),($V$35=J114)),$T$61,IF(AND(($U$62=H114),($X$35=J114)),$T$62,IF(AND(($U$63=H114),($V$35=J114)),$T$63,IF(AND(($U$64=H114),($X$35=J114)),$T$64,IF(AND(($U$65=H114),($V$35=J114)),$T$65,IF(AND(($U$66=H114),($X$35=J114)),$T$66,IF(AND(($U$67=H114),($W$35=J114)),$T$67,IF(AND(($U$68=H114),($X$35=J114)),$T$68,IF(AND(($U$69=H114),(W$35=J114)),$T$69,\"\"))))))))))))))))))))))))))))))))))","v":{"$error":"#REF!"}}]
[null,null,null,null,null,null,null,null,null,null,null,null,null,{"$f":"IF(AND(($U$36=H117),($Z$35=J117)),$T$36,IF(AND(($U$37=$H$33),($W$35=J117)),$T$37,IF(AND(($U$38=H117),($Z$35=J117)),$T$38,IF(AND(($U$39=H117),($V$35=J117)),$T$39,IF(AND(($U$40=H117),($X$35=J117)),$T$40,IF(AND(($U$41=H117),($X$35=J117)),$T$41,IF(AND(($U$42=H117),($V$35=J117)),$T$42,IF(AND(($U$43=H117),($V$35=J117)),$T$43,IF(AND(($U$44=H117),($W$35=J117)),$T$44,IF(AND(($U$45=H117),($X$35=J117)),$T$45,IF(AND(($U$46=H117),($V$35=J117)),$T$46,IF(AND(($U$48=H117),($W$35=J117)),$T$48,IF(AND(($U$49=H117),($V$35=J117)),$T$49,IF(AND(($U$50=H117),($W$35=J117)),$T$50,IF(AND(($U$51=H117),($X$35=J117)),$T$51,IF(AND(($U$52=H117),($V$35=J117)),$T$52,IF(AND(($U$53=H117),($W$35=J117)),$T$53,IF(AND(($U$54=H117),($X$35=J117)),$T$54,IF(AND(($U$55=H117),($Y$35=J117)),$T$55,IF(AND(($U$56=H117),($W$35=J117)),$T$56,IF(AND((#REF!=H117),($W$35=J117)),#REF!,IF(AND(($U$57=H117),($W$35=J117)),$T$57,IF(AND(($U$58=H117),($W$35=J117)),$T$58,IF(AND(($U$59=H117),($X$35=J117)),$T$59,IF(AND(($U$60=H117),($W$35=J117)),$T$60,IF(AND(($U$61=H117),($V$35=J117)),$T$61,IF(AND(($U$62=H117),($X$35=J117)),$T$62,IF(AND(($U$63=H117),($V$35=J117)),$T$63,IF(AND(($U$64=H117),($X$35=J117)),$T$64,IF(AND(($U$65=H117),($V$35=J117)),$T$65,IF(AND(($U$66=H117),($X$35=J117)),$T$66,IF(AND(($U$67=H117),($W$35=J117)),$T$67,IF(AND(($U$68=H117),($X$35=J117)),$T$68,IF(AND(($U$69=H117),(W$35=J117)),$T$69,\"\"))))))))))))))))))))))))))))))))))","v":0}]