{"text_format":"1","workbook":"xlsx","n_sheets":4,"sheets":["Tabela danych","Kalkulacja","Literki","Arkusz3"],"not_rendered":{"charts":0,"images":3,"macros":1,"external_links":0,"defined_names":2,"comments":0,"pivot_tables":0},"unopened":[],"bounds":{"document_bytes":16777216,"sheet_cells":100000,"rows_first":2000,"rows_last":500,"rows_between":2000,"halvings":0,"cell_chars":16384,"cell_head_chars":4096},"cells_cut":0,"cells_raw":0,"read":"whole","date_system":"1900"}

{"sheet":"Tabela danych","index":0,"n_rows":50,"n_cols":40,"rows_kept":50,"cut":false,"hidden":false,"merged":[[49,6,51,7],[31,0,47,0],[22,0,30,0],[2,0,21,0],[39,3,43,3],[39,7,43,7],[31,7,34,7],[35,7,38,7],[44,7,47,7],[44,3,47,3],[31,4,34,4],[35,4,38,4],[39,4,43,4],[31,3,34,3],[35,3,38,3],[44,5,47,5],[44,4,47,4],[26,5,29,5],[31,5,34,5],[35,5,38,5],[39,5,43,5],[26,7,29,7],[3,5,5,5],[6,5,9,5],[10,5,12,5],[13,5,17,5],[18,5,21,5],[3,7,5,7],[6,7,9,7],[10,7,12,7],[13,7,17,7],[18,7,21,7],[26,3,29,3],[3,3,5,3],[6,3,9,3],[10,3,12,3],[3,4,5,4],[6,4,9,4],[10,4,12,4],[48,3,48,10],[3,6,5,6],[6,6,9,6],[10,6,12,6],[13,6,17,6],[18,6,21,6],[26,6,29,6],[31,6,34,6],[35,6,38,6],[39,6,43,6],[44,6,47,6],[13,3,17,3],[18,3,21,3],[13,4,17,4],[18,4,21,4],[26,4,29,4]]}
["W komórce A2 wpisz 5-cio cyfrowy numer katalogowy oprawy bez zasilacza","Ilość opraw na zasilacz [wypełnia się automatycznie po uzupełnieniu komórki A2]","Średnica otworu montażowego [mm]",null,"Odśwież",{"$f":"IF(A2>0,VLOOKUP(A2,Arkusz3!B32:N114,4,0),\" \")","v":" "},"Napięcie [V] oprawy",{"$f":"IF(A2>0,VLOOKUP(A2,Arkusz3!B32:N114,8,0),\" \")","v":" "}]
[null,{"$f":"IF(A2>0,VLOOKUP(A2,Arkusz3!B31:N116,13,0),\" \")","v":" "},{"$f":"IF(A2>0,VLOOKUP(A2,Arkusz3!B32:N114,10,0),\" \")","v":" "},"L.p.","Kod produktu","Nazwa","Wymiary                  L x W x H [mm]","Min otwór montażowy [mm]","Prąd [mA]","Napięcie min [V]","Napięcie max [V]","A","B","C","D","E","F","G","H","I","J","K","L","M","N","O","P","Q","R","S","T","U","V","W","X","Y","Z","AA","AB","AD"]
["ON/OFF",{"$f":"_xlfn._xlws.FILTER($L$3:$AN$48,$L$2:$AN$2=B2)","v":{"$error":"#VALUE!"}},null,1,81224,"POWER SUPPLY On/Off 9W 250mA 2-36V","68 x 41,6 x 22",48,250,2,36,"","","","","","(1-1)","","","","",""," ","","","","","","","","","","","","","","","",""]
[null,null,null,3,81226,"POWER SUPPLY On/Off 22W 125-500mA 5-44V","146,5 x 43,5 x 22",49,250,10,44,"","","","","","(1-1)","","","","(1-1)",""," ","","","","","","","","","","","","","","","","",""]
[null,null,null,null,null,null,null,null,350,10,44,"","","","(2-7)","","","(1-2)","","(1-1)","","(1-1)"," ","(1-1)","","(1-3)","(1-1)","(1-1)","(1-1)","","","","","(1-3)","","","","","","(2-4)"]
[null,null,null,null,null,null,null,null,500,5,44,"","","(1-7)","","(1-5)","","","(1-2)","","","","(1-1)","","(1-1)","","","","","(1-1)","(1-2)","(1-1)","","","","(1-3)","(1-1)","(1-2)","(1-1)",""]
{"$rows_left_out":45}
{"sheet":"Kalkulacja","index":1,"n_rows":62,"n_cols":124,"rows_kept":62,"cut":false,"hidden":true,"merged":[]}
[null,null,null,null,null,null,null,null,null,"AQ micro","AQ micro","AQ micro","Points-X1-GR (1szt)","Points-X1-GR (1szt)","Points-X1-GR (1szt)","Points-X1-GR (2szt)","Points x1 gr","Points x1 gr","Points-X1-GR (3szt)","Points x1 gr","Points x1 gr","V6","Points x1 gr (2szt)","Points x1 gr (2szt)","V6-HD","V6","V6","V8         350mA","V8         350mA","V8         350mA","V8         500mA","V8         500mA","V8         500mA","Vero 10SE 350mA","Vero 10SE 350mA","Vero 10SE 350mA","V10     250mA","V10     250mA","V10     250mA","V10     350mA","V10     350mA","V10     350mA","V10     500mA","V10     500mA","V10     500mA","V13    350mA","V13    350mA","V13    350mA","V13    500mA","V13    500mA","V13    500mA","Wallwasher x1","Wallwasher x1","Wallwasher x1","Wallwasher x2","Wallwasher x2","Wallwasher x2","Wallwasher x3","Wallwasher x3","Wallwasher x3","Mini ring rim","Mini ring rim","Mini ring rim","Midi ring rim","Midi ring rim","Midi ring rim","Points-X5-GR (1szt)","Points-X5-GR (1szt)","Points-X5-GR (1szt)","Points-X5-GR (2szt)","Points-X5-GR (2szt)","Points-X5-GR (2szt)","Points-X5-GR (3szt)","Points-X5-GR (3szt)","Points-X5-GR (3szt)","Points-X5-DA","Points-X5-DA","Points-X5-DA","ring","ring","ring","Rafter SQ 8","Rafter SQ 8","Rafter SQ 8","Rafter SQ 11","Rafter SQ 11","Rafter SQ 11","Rafter mini 14","Rafter mini 14","Rafter mini 14","Rafter mini 26","Rafter mini 26","Rafter mini 26","V6","V6","V6"]
[null,"L.p.","Ikona","Nazwa","Nazwa do katalogu","Min otwór montażowy [mm]","Prąd [mA]","Napięcie min [V]","Napięcie max [V]","A","A","A","B","B","B","C","C","C","D","D","D","E","E","E","F","F","F","G","G","G","H","H","H","I","I","I","J","J","J","K","K","K","L","L","L","M","M","M","N","N","N","O","O","O","P","P","P","Q","Q","Q","R","R","R","S","S","S","T","T","T","U","U","U","V","V","V","W","W","W","X","X","X","Y","Y","Y","Z","Z","Z","AA","AA","AA","AB","AB","AB","AD","AD","AD"]
[null,null,null,null,null,null,null,null,null,"min.","max","zakres","min.","max","zakres","min.","max","zakres","min.","max","zakres","min.","max.","zakres","min","max","zakres","min","max","zakres","min","max","zakres","min","max","zakres","min","max","zakres","min","max","zakres","min","max","zakres","min","max","zakres","min","max","zakres","min","max","zakres","min","max","zakres","min","max","zakres","min","max","zakres","min","max","zakres","min","max","zakres","min","max","zakres","min","max","zakres","min","max","zakres","min","max","zakres","min","max","zakres","min","max","zakres","min","max","zakres","min","max","zakres","min","max","zakres"]
[null,1,null,"TCI BULL HPFU 9W 250mA","Zasilacz On/Off 8W AQXXXXX 220-240V/50-60Hz/IP20",48,250,2,36,{"$f":"IF($CY$5>I4,0,IF(G4=$CY$4,IF($CY$5<H4,IF(2*$CY$5<H4,IF(3*$CY$5<H4,IF(4*$CY$5<H4,IF(5*$CY$5<H4,\"\",\"5\"),\"4\"),\"3\"),\"2\"),1),0))","v":0},null,{"$f":"_xlfn.IFNA(IF(J4>0,\"(\"&J4&\"-\"&K4&\")\",\"\"),\"\")","v":""},{"$f":"IF($CY$6>I4,0,IF(G4=$CY$4,IF($CY$6<H4,IF(2*$CY$6<H4,IF(3*$CY$6<H4,IF(4*$CY$6<H4,IF(5*$CY$6<H4,IF(6*$CY$6<H4,\"\",\"6\"),\"5\"),\"4\"),\"3\"),\"2\"),\"1\"),\"0\"))","v":"0"},{"$f":"IF(G4=$CY$4,FLOOR(IF(G4=$CY$4,I4/$CY$6,\"\"),1),\"\")","v":""},{"$f":"IF(M4=\"0\",\"\",\"(\"&M4&\"-\"&N4&\")\")","v":""},{"$f":"IF($CW$7>I4,0,IF(G4=$CW$4,IF($CW$7<H4,IF(2*$CW$7<H4,IF(3*$CW$7<H4,IF(4*$CW$7<H4,\"\",\"4\"),\"3\"),\"2\"),1),0))","v":0},{"$f":"IF(G4=$CW$4,FLOOR(IF(G4=$CW$4,I4/$CW$7,\"\"),1),\"\")","v":""},{"$f":"_xlfn.IFNA(IF(P4>0,\"(\"&P4&\"-\"&Q4&\")\",\"\"),\"\")","v":""},{"$f":"IF($CV$8>I4,0,IF(G4=$CV$4,IF($CV$8<H4,IF(2*$CV$8<H4,IF(3*$CV$8<H4,IF(4*$CV$8<H4,IF(5*$CV$8<H4,IF(6*$CV$8<H4,\"\",\"6\"),\"5\"),\"4\"),\"3\"),\"2\"),1),0))","v":0},{"$f":"IF(G4=$CV$4,FLOOR(IF(G4=$CV$4,I4/$CV$8,\"\"),1),\"\")","v":""},{"$f":"_xlfn.IFNA(IF(S4>0,\"(\"&S4&\"-\"&T4&\")\",\"\"),\"\")","v":""},{"$f":"IF($CW$9>I4,0,IF(G4=$CW$4,IF($CW$9<H4,IF(2*$CW$9<H4,IF(3*$CW$9<H4,IF(4*$CW$9<H4,IF(5*$CW$9<H4,\"\",\"5\"),\"4\"),\"3\"),\"2\"),1),0))","v":0},{"$f":"IF(G4=$CW$4,FLOOR(IF(G4=$CW$4,I4/$CW$9,\"\"),1),\"\")","v":""},{"$f":"_xlfn.IFNA(IF(V4>0,\"(\"&V4&\"-\"&W4&\")\",\"\"),\"\")","v":""},{"$f":"IF($CU$10>I4,0,IF(G4=$CU$4,IF($CU$10<H4,IF(2*$CU$10<H4,IF(3*$CU$10<H4,\"\",\"3\"),\"2\"),1),0))","v":1},{"$f":"IF(G4=$CU$4,FLOOR(IF(G4=$CU$4,I4/$CU$10,\"\"),1),\"\")","v":1},{"$f":"_xlfn.IFNA(IF(Y4>0,\"(\"&Y4&\"-\"&Z4&\")\",\"\"),\"\")","v":"(1-1)"},{"$f":"IF($CV$11>I4,0,IF(G4=$CV$4,IF($CV$11<H4,IF(2*$CV$11<H4,IF(3*$CV$11<H4,\"\",\"3\"),\"2\"),1),0))","v":0},{"$f":"IF(G4=$CV$4,FLOOR(IF(G4=$CV$4,I4/$CV$11,\"\"),1),\"\")","v":""},{"$f":"_xlfn.IFNA(IF(AB4>0,\"(\"&AB4&\"-\"&AC4&\")\",\"\"),\"\")","v":""},{"$f":"IF($CW$12>I4,0,IF(G4=$CW$4,IF($CW$12<H4,IF(2*$CW$12<H4,IF(3*$CW$12<H4,\"\",\"3\"),\"2\"),1),0))","v":0},{"$f":"IF(G4=$CW$4,FLOOR(IF(G4=$CW$4,I4/$CW$12,\"\"),1),\"\")","v":""},{"$f":"_xlfn.IFNA(IF(AE4>0,\"(\"&AE4&\"-\"&AF4&\")\",\"\"),\"\")","v":""},{"$f":"IF($CV$13>I4,0,IF(G4=$CV$4,IF($CV$13<H4,IF(2*$CV$13<H4,IF(3*$CV$13<H4,\"\",\"3\"),\"2\"),1),0))","v":0},{"$f":"IF(G4=$CV$4,FLOOR(IF(G4=$CV$4,I4/$CV$13,\"\"),1),\"\")","v":""},{"$f":"_xlfn.IFNA(IF(AH4>0,\"(\"&AH4&\"-\"&AI4&\")\",\"\"),\"\")","v":""},{"$f":"IF($CU$14>I4,0,IF(G4=$CU$4,IF($CU$14<H4,IF(2*$CU$14<H4,IF(3*$CU$14<H4,\"\",\"3\"),\"2\"),1),0))","v":1},{"$f":"IF(G4=$CU$4,FLOOR(IF(G4=$CU$4,I4/$CU$14,\"\"),1),\"\")","v":1},{"$f":"_xlfn.IFNA(IF(AK4>0,\"(\"&AK4&\"-\"&AL4&\")\",\"\"),\"\")","v":"(1-1)"},{"$f":"IF($CV$4=G4,IF($CV$15>H4,IF($CV$15<I4,\"1\",\"0\"),IF(AND((2*$CV$15>H4),(2*$CJU$15<I4)),\"2\",\"0\")),\"0\")","v":"0"},{"$f":"IF(G4=$CV$4,IF(AND(($CV$15>H4),($CV$15<I4)),IF(2*$CV$15<I4,\"2\",\"1\"),\"0\"),\"0\")","v":"0"},{"$f":"IF(AN4=\"0\",\"\",\"(\"&AN4&\"-\"&AO4&\")\")","v":""},{"$f":"IF($CW$4=G4,IF($CW$16>H4,IF($CW$16<I4,\"1\",\"0\"),IF(AND((2*$CW$16>H4),(2*$CW$16<I4)),\"2\",\"0\")),\"0\")","v":"0"},{"$f":"IF(G4=$CW$4,IF(AND(($CW$16>H4),($CW$16<I4)),IF(2*$CW$16<I4,\"2\",\"1\"),\"0\"),\"0\")","v":"0"},{"$f":"IF(AQ4=\"0\",\" \",\"(\"&AQ4&\"-\"&AR4&\")\")","v":" "},{"$f":"IF($CV$17>I4,0,IF(G4=$CV$4,IF($CV$17<H4,IF(2*$CV$17<H4,IF(3*$CV$17<H4,\"\",\"3\"),\"2\"),1),0))","v":0},{"$f":"IF(G4=$CV$4,FLOOR(IF(G4=$CV$4,I4/$CV$17,\"\"),1),\"\")","v":""},{"$f":"_xlfn.IFNA(IF(AT4>0,\"(\"&AT4&\"-\"&AU4&\")\",\"\"),\"\")","v":""},{"$f":"IF($CW$18>I4,0,IF(G4=$CW$4,IF($CW$18<H4,IF(2*$CW$18<H4,IF(3*$CW$18<H4,\"\",\"3\"),\"2\"),1),0))","v":0},{"$f":"IF(G4=$CW$4,FLOOR(IF(G4=$CW$4,I4/$CW$18,\"\"),1),\"\")","v":""},{"$f":"_xlfn.IFNA(IF(AW4>0,\"(\"&AW4&\"-\"&AX4&\")\",\"\"),\"\")","v":""},{"$f":"IF($CV$19>I4,0,IF(G4=$CV$4,IF($CV$19<H4,IF(2*$CV$19<H4,IF(3*$CV$19<H4,\"\",\"3\"),\"2\"),1),0))","v":0},{"$f":"IF(G4=$CV$4,FLOOR(IF(G4=$CV$4,I4/$CV$19,\"\"),1),\"\")","v":""},{"$f":"_xlfn.IFNA(IF(AZ4>0,\"(\"&AZ4&\"-\"&BA4&\")\",\"\"),\"\")","v":""},{"$f":"IF($CV$20>I4,0,IF(G4=$CV$4,IF($CV$20<H4,IF(2*$CV$20<H4,IF(3*$CV$20<H4,\"\",\"3\"),\"2\"),1),0))","v":0},{"$f":"IF(G4=$CV$4,FLOOR(IF(G4=$CV$4,I4/$CV$20,\"\"),1),\"\")","v":""},{"$f":"_xlfn.IFNA(IF(BC4>0,\"(\"&BC4&\"-\"&BD4&\")\",\"\"),\"\")","v":""},{"$f":"IF($CV$21>I4,0,IF(G4=$CV$4,IF($CV$21<H4,IF(2*$CV$21<H4,IF(3*$CV$21<H4,\"\",\"3\"),\"2\"),1),0))","v":0},{"$f":"IF(G4=$CV$4,FLOOR(IF(G4=$CV$4,I4/$CV$21,\"\"),1),\"\")","v":""},{"$f":"_xlfn.IFNA(IF(BF4>0,\"(\"&BF4&\"-\"&BG4&\")\",\"\"),\"\")","v":""},{"$f":"IF($CV$22>I4,0,IF(G4=$CV$4,IF($CV$22<H4,IF(2*$CV$22<H4,IF(3*$CV$22<H4,\"\",\"3\"),\"2\"),1),0))","v":0},{"$f":"IF(G4=$CV$4,FLOOR(IF(G4=$CV$4,I4/$CV$22,\"\"),1),\"\")","v":""},{"$f":"_xlfn.IFNA(IF(BI4>0,\"(\"&BI4&\"-\"&BJ4&\")\",\"\"),\"\")","v":""},{"$f":"IF($CW$23>I4,0,IF(G4=$CW$4,IF($CW$23<H4,IF(2*$CW$23<H4,IF(3*$CW$23<H4,\"\",\"3\"),\"2\"),1),0))","v":0},{"$f":"IF(G4=$CW$4,FLOOR(IF(G4=$CW$4,I4/$CW$23,\"\"),1),\"\")","v":""},{"$f":"_xlfn.IFNA(IF(BL4>0,\"(\"&BL4&\"-\"&BM4&\")\",\"\"),\"\")","v":""},{"$f":"IF($CW$24>I4,0,IF(G4=$CW$4,IF($CW$24<H4,IF(2*$CW$24<H4,IF(3*$CW$24<H4,\"\",\"3\"),\"2\"),1),0))","v":0},{"$f":"IF(G4=$CW$4,FLOOR(IF(G4=$CW$4,I4/$CW$24,\"\"),1),\"\")","v":""},{"$f":"_xlfn.IFNA(IF(BO4>0,\"(\"&BO4&\"-\"&BP4&\")\",\"\"),\"\")","v":""},{"$f":"IF($CW$25>I4,0,IF(G4=$CW$4,IF($CW$25<H4,IF(2*$CW$25<H4,IF(3*$CW$25<H4,\"\",\"3\"),\"2\"),1),0))","v":0},{"$f":"IF(G4=$CW$4,FLOOR(IF(G4=$CW$4,I4/$CW$25,\"\"),1),\"\")","v":""},{"$f":"_xlfn.IFNA(IF(BR4>0,\"(\"&BR4&\"-\"&BS4&\")\",\"\"),\"\")","v":""},{"$f":"IF($CW$26>I4,0,IF(G4=$CW$4,IF($CW$26<H4,IF(2*$CW$26<H4,IF(3*$CW$26<H4,\"\",\"3\"),\"2\"),1),0))","v":0},{"$f":"IF(G4=$CW$4,FLOOR(IF(G4=$CW$4,I4/$CW$26,\"\"),1),\"\")","v":""},{"$f":"_xlfn.IFNA(IF(BU4>0,\"(\"&BU4&\"-\"&BV4&\")\",\"\"),\"\")","v":""},{"$f":"IF($CV$27>I4,0,IF(G4=$CV$4,IF($CV$27<H4,IF(2*$CV$27<H4,IF(3*$CV$27<H4,\"\",\"3\"),\"2\"),1),0))","v":0},{"$f":"IF(G4=$CV$4,FLOOR(IF(G4=$CV$4,I4/$CV$27,\"\"),1),\"\")","v":""},{"$f":"_xlfn.IFNA(IF(BX4>0,\"(\"&BX4&\"-\"&BY4&\")\",\"\"),\"\")","v":""},{"$f":"IF($CY$28>I4,0,IF(G4=$CY$4,IF($CY$28<H4,IF(2*$CY$28<H4,IF(3*$CY$28<H4,\"\",\"3\"),\"2\"),1),0))","v":0},{"$f":"IF(G4=$CY$4,FLOOR(IF(G4=$CY$4,I4/$CY$28,\"\"),1),\"\")","v":""},{"$f":"_xlfn.IFNA(IF(CA4>0,\"(\"&CA4&\"-\"&CB4&\")\",\"\"),\"\")","v":""},{"$f":"IF($CW$29>I4,0,IF(G4=$CW$4,IF($CW$29<H4,IF(2*$CW$29<H4,IF(3*$CW$29<H4,\"\",\"3\"),\"2\"),1),0))","v":0},{"$f":"IF(G4=$CW$4,FLOOR(IF(G4=$CW$4,I4/$CW$29,\"\"),1),\"\")","v":""},{"$f":"_xlfn.IFNA(IF(CD4>0,\"(\"&CD4&\"-\"&CE4&\")\",\"\"),\"\")","v":""},{"$f":"IF($CW$30>I4,0,IF(G4=$CW$4,IF($CW$30<H4,IF(2*$CW$30<H4,IF(3*$CW$30<H4,\"\",\"3\"),\"2\"),1),0))","v":0},{"$f":"IF(G4=$CW$4,FLOOR(IF(G4=$CW$4,I4/$CW$30,\"\"),1),\"\")","v":""},{"$f":"_xlfn.IFNA(IF(CG4>0,\"(\"&CG4&\"-\"&CH4&\")\",\"\"),\"\")","v":""},{"$f":"IF($CW$31>I4,0,IF(G4=$CW$4,IF($CW$31<H4,IF(2*$CW$31<H4,IF(3*$CW$31<H4,\"\",\"3\"),\"2\"),1),0))","v":0},{"$f":"IF(G4=$CW$4,FLOOR(IF(G4=$CW$4,I4/$CW$31,\"\"),1),\"\")","v":""},{"$f":"_xlfn.IFNA(IF(CJ4>0,\"(\"&CJ4&\"-\"&CK4&\")\",\"\"),\"\")","v":""},{"$f":"IF($CW$32>I4,0,IF(G4=$CW$4,IF($CW$32<H4,IF(2*$CW$32<H4,IF(3*$CW$32<H4,\"\",\"3\"),\"2\"),1),0))","v":0},{"$f":"IF(G4=$CW$4,FLOOR(IF(G4=$CW$4,I4/$CW$32,\"\"),1),\"\")","v":""},{"$f":"_xlfn.IFNA(IF(CM4>0,\"(\"&CM4&\"-\"&CN4&\")\",\"\"),\"\")","v":""},{"$f":"IF($CV$33>I4,0,IF(G4=$CV$4,IF($CV$33<H4,IF(2*$CV$33<H4,IF(3*$CV$33<H4,IF(4*$CV$33<H4,IF(5*$CV$33<H4,\"\",\"5\"),\"4\"),\"3\"),\"2\"),1),0))","v":0},{"$f":"IF(G4=$CV$4,FLOOR(IF(G4=$CV$4,I4/$CV$33,\"\"),1),\"\")","v":""},{"$f":"_xlfn.IFNA(IF(CP4>0,\"(\"&CP4&\"-\"&CQ4&\")\",\"\"),\"\")","v":""},null,null,250,350,500,600,700,1050,null,null,null,null,250,350,500,600,700,1050,null,null,null,null,250,350,500,600,700,1050]
[null,2,null,"TCI BULL 8W 350mA","Zasilacz On/Off 9W AQXXXXX 220-240V/50-60Hz/IP20",42,350,2,22,{"$f":"IF($CY$5>I5,0,IF(G5=$CY$4,IF($CY$5<H5,IF(2*$CY$5<H5,IF(3*$CY$5<H5,IF(4*$CY$5<H5,IF(5*$CY$5<H5,\"\",\"5\"),\"4\"),\"3\"),\"2\"),1),0))","v":0},{"$f":"IF(G5=$CY$4,FLOOR(IF(G5=$CY$4,I5/$CY$5,\"\"),1),\"\")","v":""},{"$f":"_xlfn.IFNA(IF(J5>0,\"(\"&J5&\"-\"&K5&\")\",\"\"),\"\")","v":""},{"$f":"IF($CY$6>I5,0,IF(G5=$CY$4,IF($CY$6<H5,IF(2*$CY$6<H5,IF(3*$CY$6<H5,IF(4*$CY$6<H5,IF(5*$CY$6<H5,IF(6*$CY$6<H5,\"\",\"6\"),\"5\"),\"4\"),\"3\"),\"2\"),\"1\"),\"0\"))","v":"0"},{"$f":"IF(G5=$CY$4,FLOOR(IF(G5=$CY$4,I5/$CY$6,\"\"),1),\"\")","v":""},{"$f":"IF(M5=\"0\",\"\",\"(\"&M5&\"-\"&N5&\")\")","v":""},{"$f":"IF($CW$7>I5,0,IF(G5=$CW$4,IF($CW$7<H5,IF(2*$CW$7<H5,IF(3*$CW$7<H5,IF(4*$CW$7<H5,\"\",\"4\"),\"3\"),\"2\"),1),0))","v":0},{"$f":"IF(G5=$CW$4,FLOOR(IF(G5=$CW$4,I5/$CW$7,\"\"),1),\"\")","v":""},{"$f":"_xlfn.IFNA(IF(P5>0,\"(\"&P5&\"-\"&Q5&\")\",\"\"),\"\")","v":""},{"$f":"IF($CV$8>I5,0,IF(G5=$CV$4,IF($CV$8<H5,IF(2*$CV$8<H5,IF(3*$CV$8<H5,IF(4*$CV$8<H5,IF(5*$CV$8<H5,IF(6*$CV$8<H5,\"\",\"6\"),\"5\"),\"4\"),\"3\"),\"2\"),1),0))","v":1},{"$f":"IF(G5=$CV$4,FLOOR(IF(G5=$CV$4,I5/$CV$8,\"\"),1),\"\")","v":4},{"$f":"_xlfn.IFNA(IF(S5>0,\"(\"&S5&\"-\"&T5&\")\",\"\"),\"\")","v":"(1-4)"},{"$f":"IF($CW$9>I5,0,IF(G5=$CW$4,IF($CW$9<H5,IF(2*$CW$9<H5,IF(3*$CW$9<H5,IF(4*$CW$9<H5,IF(5*$CW$9<H5,\"\",\"5\"),\"4\"),\"3\"),\"2\"),1),0))","v":0},{"$f":"IF(G5=$CW$4,FLOOR(IF(G5=$CW$4,I5/$CW$9,\"\"),1),\"\")","v":""},{"$f":"_xlfn.IFNA(IF(V5>0,\"(\"&V5&\"-\"&W5&\")\",\"\"),\"\")","v":""},{"$f":"IF($CU$10>I5,0,IF(G5=$CU$4,IF($CU$10<H5,IF(2*$CU$10<H5,IF(3*$CU$10<H5,\"\",\"3\"),\"2\"),1),0))","v":0},{"$f":"IF(G5=$CU$4,FLOOR(IF(G5=$CU$4,I5/$CU$10,\"\"),1),\"\")","v":""},{"$f":"_xlfn.IFNA(IF(Y5>0,\"(\"&Y5&\"-\"&Z5&\")\",\"\"),\"\")","v":""},{"$f":"IF($CV$11>I5,0,IF(G5=$CV$4,IF($CV$11<H5,IF(2*$CV$11<H5,IF(3*$CV$11<H5,\"\",\"3\"),\"2\"),1),0))","v":1},{"$f":"IF(G5=$CV$4,FLOOR(IF(G5=$CV$4,I5/$CV$11,\"\"),1),\"\")","v":1},{"$f":"_xlfn.IFNA(IF(AB5>0,\"(\"&AB5&\"-\"&AC5&\")\",\"\"),\"\")","v":"(1-1)"},{"$f":"IF($CW$12>I5,0,IF(G5=$CW$4,IF($CW$12<H5,IF(2*$CW$12<H5,IF(3*$CW$12<H5,\"\",\"3\"),\"2\"),1),0))","v":0},{"$f":"IF(G5=$CW$4,FLOOR(IF(G5=$CW$4,I5/$CW$12,\"\"),1),\"\")","v":""},{"$f":"_xlfn.IFNA(IF(AE5>0,\"(\"&AE5&\"-\"&AF5&\")\",\"\"),\"\")","v":""},{"$f":"IF($CV$13>I5,0,IF(G5=$CV$4,IF($CV$13<H5,IF(2*$CV$13<H5,IF(3*$CV$13<H5,\"\",\"3\"),\"2\"),1),0))","v":0},{"$f":"IF(G5=$CV$4,FLOOR(IF(G5=$CV$4,I5/$CV$13,\"\"),1),\"\")","v":0},{"$f":"_xlfn.IFNA(IF(AH5>0,\"(\"&AH5&\"-\"&AI5&\")\",\"\"),\"\")","v":""},{"$f":"IF($CU$14>I5,0,IF(G5=$CU$4,IF($CU$14<H5,IF(2*$CU$14<H5,IF(3*$CU$14<H5,\"\",\"3\"),\"2\"),1),0))","v":0},{"$f":"IF(G5=$CU$4,FLOOR(IF(G5=$CU$4,I5/$CU$14,\"\"),1),\"\")","v":""},{"$f":"_xlfn.IFNA(IF(AK5>0,\"(\"&AK5&\"-\"&AL5&\")\",\"\"),\"\")","v":""},{"$f":"IF($CV$4=G5,IF($CV$15>H5,IF($CV$15<I5,\"1\",\"0\"),IF(AND((2*$CV$15>H5),(2*$CJU$15<I5)),\"2\",\"0\")),\"0\")","v":"0"},{"$f":"IF(G5=$CV$4,IF(AND(($CV$15>H5),($CV$15<I5)),IF(2*$CV$15<I5,\"2\",\"1\"),\"0\"),\"0\")","v":"0"},{"$f":"IF(AN5=\"0\",\"\",\"(\"&AN5&\"-\"&AO5&\")\")","v":""},{"$f":"IF($CW$4=G5,IF($CW$16>H5,IF($CW$16<I5,\"1\",\"0\"),IF(AND((2*$CW$16>H5),(2*$CW$16<I5)),\"2\",\"0\")),\"0\")","v":"0"},{"$f":"IF(G5=$CW$4,IF(AND(($CW$16>H5),($CW$16<I5)),IF(2*$CW$16<I5,\"2\",\"1\"),\"0\"),\"0\")","v":"0"},{"$f":"IF(AQ5=\"0\",\" \",\"(\"&AQ5&\"-\"&AR5&\")\")","v":" "},{"$f":"IF($CV$17>I5,0,IF(G5=$CV$4,IF($CV$17<H5,IF(2*$CV$17<H5,IF(3*$CV$17<H5,\"\",\"3\"),\"2\"),1),0))","v":0},{"$f":"IF(G5=$CV$4,FLOOR(IF(G5=$CV$4,I5/$CV$17,\"\"),1),\"\")","v":0},{"$f":"_xlfn.IFNA(IF(AT5>0,\"(\"&AT5&\"-\"&AU5&\")\",\"\"),\"\")","v":""},{"$f":"IF($CW$18>I5,0,IF(G5=$CW$4,IF($CW$18<H5,IF(2*$CW$18<H5,IF(3*$CW$18<H5,\"\",\"3\"),\"2\"),1),0))","v":0},{"$f":"IF(G5=$CW$4,FLOOR(IF(G5=$CW$4,I5/$CW$18,\"\"),1),\"\")","v":""},{"$f":"_xlfn.IFNA(IF(AW5>0,\"(\"&AW5&\"-\"&AX5&\")\",\"\"),\"\")","v":""},{"$f":"IF($CV$19>I5,0,IF(G5=$CV$4,IF($CV$19<H5,IF(2*$CV$19<H5,IF(3*$CV$19<H5,\"\",\"3\"),\"2\"),1),0))","v":1},{"$f":"IF(G5=$CV$4,FLOOR(IF(G5=$CV$4,I5/$CV$19,\"\"),1),\"\")","v":1},{"$f":"_xlfn.IFNA(IF(AZ5>0,\"(\"&AZ5&\"-\"&BA5&\")\",\"\"),\"\")","v":"(1-1)"},{"$f":"IF($CV$20>I5,0,IF(G5=$CV$4,IF($CV$20<H5,IF(2*$CV$20<H5,IF(3*$CV$20<H5,\"\",\"3\"),\"2\"),1),0))","v":0},{"$f":"IF(G5=$CV$4,FLOOR(IF(G5=$CV$4,I5/$CV$20,\"\"),1),\"\")","v":0},{"$f":"_xlfn.IFNA(IF(BC5>0,\"(\"&BC5&\"-\"&BD5&\")\",\"\"),\"\")","v":""},{"$f":"IF($CV$21>I5,0,IF(G5=$CV$4,IF($CV$21<H5,IF(2*$CV$21<H5,IF(3*$CV$21<H5,\"\",\"3\"),\"2\"),1),0))","v":0},{"$f":"IF(G5=$CV$4,FLOOR(IF(G5=$CV$4,I5/$CV$21,\"\"),1),\"\")","v":0},{"$f":"_xlfn.IFNA(IF(BF5>0,\"(\"&BF5&\"-\"&BG5&\")\",\"\"),\"\")","v":""},{"$f":"IF($CV$22>I5,0,IF(G5=$CV$4,IF($CV$22<H5,IF(2*$CV$22<H5,IF(3*$CV$22<H5,\"\",\"3\"),\"2\"),1),0))","v":0},{"$f":"IF(G5=$CV$4,FLOOR(IF(G5=$CV$4,I5/$CV$22,\"\"),1),\"\")","v":0},{"$f":"_xlfn.IFNA(IF(BI5>0,\"(\"&BI5&\"-\"&BJ5&\")\",\"\"),\"\")","v":""},{"$f":"IF($CW$23>I5,0,IF(G5=$CW$4,IF($CW$23<H5,IF(2*$CW$23<H5,IF(3*$CW$23<H5,\"\",\"3\"),\"2\"),1),0))","v":0},{"$f":"IF(G5=$CW$4,FLOOR(IF(G5=$CW$4,I5/$CW$23,\"\"),1),\"\")","v":""},{"$f":"_xlfn.IFNA(IF(BL5>0,\"(\"&BL5&\"-\"&BM5&\")\",\"\"),\"\")","v":""},{"$f":"IF($CW$24>I5,0,IF(G5=$CW$4,IF($CW$24<H5,IF(2*$CW$24<H5,IF(3*$CW$24<H5,\"\",\"3\"),\"2\"),1),0))","v":0},{"$f":"IF(G5=$CW$4,FLOOR(IF(G5=$CW$4,I5/$CW$24,\"\"),1),\"\")","v":""},{"$f":"_xlfn.IFNA(IF(BO5>0,\"(\"&BO5&\"-\"&BP5&\")\",\"\"),\"\")","v":""},{"$f":"IF($CW$25>I5,0,IF(G5=$CW$4,IF($CW$25<H5,IF(2*$CW$25<H5,IF(3*$CW$25<H5,\"\",\"3\"),\"2\"),1),0))","v":0},{"$f":"IF(G5=$CW$4,FLOOR(IF(G5=$CW$4,I5/$CW$25,\"\"),1),\"\")","v":""},{"$f":"_xlfn.IFNA(IF(BR5>0,\"(\"&BR5&\"-\"&BS5&\")\",\"\"),\"\")","v":""},{"$f":"IF($CW$26>I5,0,IF(G5=$CW$4,IF($CW$26<H5,IF(2*$CW$26<H5,IF(3*$CW$26<H5,\"\",\"3\"),\"2\"),1),0))","v":0},{"$f":"IF(G5=$CW$4,FLOOR(IF(G5=$CW$4,I5/$CW$26,\"\"),1),\"\")","v":""},{"$f":"_xlfn.IFNA(IF(BU5>0,\"(\"&BU5&\"-\"&BV5&\")\",\"\"),\"\")","v":""},{"$f":"IF($CV$27>I5,0,IF(G5=$CV$4,IF($CV$27<H5,IF(2*$CV$27<H5,IF(3*$CV$27<H5,\"\",\"3\"),\"2\"),1),0))","v":1},1,{"$f":"_xlfn.IFNA(IF(BX5>0,\"(\"&BX5&\"-\"&BY5&\")\",\"\"),\"\")","v":"(1-1)"},{"$f":"IF($CY$28>I5,0,IF(G5=$CY$4,IF($CY$28<H5,IF(2*$CY$28<H5,IF(3*$CY$28<H5,\"\",\"3\"),\"2\"),1),0))","v":0},{"$f":"IF(G5=$CY$4,FLOOR(IF(G5=$CY$4,I5/$CY$28,\"\"),1),\"\")","v":""},{"$f":"_xlfn.IFNA(IF(CA5>0,\"(\"&CA5&\"-\"&CB5&\")\",\"\"),\"\")","v":""},{"$f":"IF($CW$29>I5,0,IF(G5=$CW$4,IF($CW$29<H5,IF(2*$CW$29<H5,IF(3*$CW$29<H5,\"\",\"3\"),\"2\"),1),0))","v":0},{"$f":"IF(G5=$CW$4,FLOOR(IF(G5=$CW$4,I5/$CW$29,\"\"),1),\"\")","v":""},{"$f":"_xlfn.IFNA(IF(CD5>0,\"(\"&CD5&\"-\"&CE5&\")\",\"\"),\"\")","v":""},{"$f":"IF($CW$30>I5,0,IF(G5=$CW$4,IF($CW$30<H5,IF(2*$CW$30<H5,IF(3*$CW$30<H5,\"\",\"3\"),\"2\"),1),0))","v":0},{"$f":"IF(G5=$CW$4,FLOOR(IF(G5=$CW$4,I5/$CW$30,\"\"),1),\"\")","v":""},{"$f":"_xlfn.IFNA(IF(CG5>0,\"(\"&CG5&\"-\"&CH5&\")\",\"\"),\"\")","v":""},{"$f":"IF($CW$31>I5,0,IF(G5=$CW$4,IF($CW$31<H5,IF(2*$CW$31<H5,IF(3*$CW$31<H5,\"\",\"3\"),\"2\"),1),0))","v":0},{"$f":"IF(G5=$CW$4,FLOOR(IF(G5=$CW$4,I5/$CW$31,\"\"),1),\"\")","v":""},{"$f":"_xlfn.IFNA(IF(CJ5>0,\"(\"&CJ5&\"-\"&CK5&\")\",\"\"),\"\")","v":""},{"$f":"IF($CW$32>I5,0,IF(G5=$CW$4,IF($CW$32<H5,IF(2*$CW$32<H5,IF(3*$CW$32<H5,\"\",\"3\"),\"2\"),1),0))","v":0},{"$f":"IF(G5=$CW$4,FLOOR(IF(G5=$CW$4,I5/$CW$32,\"\"),1),\"\")","v":""},{"$f":"_xlfn.IFNA(IF(CM5>0,\"(\"&CM5&\"-\"&CN5&\")\",\"\"),\"\")","v":""},{"$f":"IF($CV$33>I5,0,IF(G5=$CV$4,IF($CV$33<H5,IF(2*$CV$33<H5,IF(3*$CV$33<H5,IF(4*$CV$33<H5,IF(5*$CV$33<H5,\"\",\"5\"),\"4\"),\"3\"),\"2\"),1),0))","v":1},{"$f":"IF(G5=$CV$4,FLOOR(IF(G5=$CV$4,I5/$CV$33,\"\"),1),\"\")","v":2},{"$f":"_xlfn.IFNA(IF(CP5>0,\"(\"&CP5&\"-\"&CQ5&\")\",\"\"),\"\")","v":"(1-2)"},"A","AQ-micro",null,null,null,null,3.4,null,null,null,"A","AQ-micro",null,null,null,null,3.4,null,null,null,"A","AQ-micro",null,null,null,null,3.4]
[null,3,null,"TCI PRO FLAT 22W  ","Zasilacz On/Off 22W AQXXXXX 220-240V/50-60Hz/Ip20",49,250,10,44,0,"","",{"$f":"IF($CY$6>I6,0,IF(G6=$CY$4,IF($CY$6<H6,IF(2*$CY$6<H6,IF(3*$CY$6<H6,IF(4*$CY$6<H6,IF(5*$CY$6<H6,IF(6*$CY$6<H6,\"\",\"6\"),\"5\"),\"4\"),\"3\"),\"2\"),\"1\"),\"0\"))","v":"0"},"","",0,"","",0,"","",0,"","",1,1,"(1-1)",0,"","",0,"","",0,"","",1,1,"(1-1)","0","0","","0","0"," ",0,"","",0,"","",0,"","",0,"","",0,"","",0,"","",0,"","",0,"","",0,"","",0,"","",0,"","",0,"","",0,"","",0,"","",0,"","",0,"","",0,"","","B","Points-X1-GR (1szt)",null,null,null,null,2.9,null,null,null,"B","Points-X1-GR (1szt)",null,2.8,null,null,null,null,null,null,"B","Points-X1-GR (1szt)",null,null,null,null,2.9]
{"$rows_left_out":57}
{"sheet":"Literki","index":2,"n_rows":30,"n_cols":8,"rows_kept":30,"cut":false,"hidden":true,"merged":[]}
[null,null,250,350,500,600,700,1050]
["A","AQ-micro",null,null,null,null,3.4]
["B","Points-X1-GR (1szt)",null,null,null,null,2.9]
["C","Points-X1-GR (2szt)",null,null,5.8]
["D","Points-X1-GR (3szt)",null,5.5]
["E","V6",null,null,8.6]
{"$rows_left_out":25}
{"sheet":"Arkusz3","index":3,"n_rows":164,"n_cols":27,"rows_kept":164,"cut":false,"hidden":true,"merged":[]}
[null,null,null,null,null,"Prąd","Napięcie min [V]","Napięcie max [V]","Kod komponentu","Nazwa zasilacza","Przekątna boku zasilacza",null,null,null,null,null,null,null,null,null,null,250,350,500,600,700,1050]
[null,null,null,null,null,null,null,null,null,null,null,null,null,null,null,null,null,null,null,"A","AQ-micro",null,null,null,null,3.4]
[null,null,null,null,null,250,2,36,"E01781","TCI BULL",47.1,null,null,null,null,null,null,null,null,"B","Points-X1-GR (1szt)",null,null,null,null,2.9]
[null,null,null,null,null,null,36,50,"X","X","X",null,null,null,null,null,null,null,null,"C","Points-X1-GR (2szt)",null,null,5.8]
[null,null,null,null,null,null,null,null,null,null,null,null,null,null,null,null,null,null,null,"D","Points-X1-GR (3szt)",null,5.5]
[null,null,null,null,null,null,null,null,null,null,null,null,null,null,null,null,null,null,null,"E","V6",null,null,8.6]
{"$rows_left_out":158}